{"text_format":"1","workbook":"xlsx","n_sheets":7,"sheets":["(1) Manual de operação","(2) Premissas","(3) Eletrolisadores","(4) Entrada de dados","(5) Simulação e Fluxo de Caixa","(6) Resultados","(7) Análise de sensibilidade"],"not_rendered":{"charts":1,"images":1,"macros":1,"external_links":0,"defined_names":79,"comments":1,"pivot_tables":0},"unopened":[],"bounds":{"document_bytes":16777216,"sheet_cells":100000,"rows_first":2000,"rows_last":500,"rows_between":2000,"halvings":0,"cell_chars":16384,"cell_head_chars":4096},"cells_cut":0,"cells_raw":0,"read":"whole","date_system":"1900"}

{"sheet":"(1) Manual de operação","index":0,"n_rows":0,"n_cols":0,"rows_kept":0,"cut":false,"hidden":false,"merged":[]}

{"sheet":"(2) Premissas","index":1,"n_rows":70,"n_cols":33,"rows_kept":70,"cut":false,"hidden":false,"merged":[]}
[]
[null,"2. Premissas",null,null,null,null,null,null,null,null,null,null,null,null,null,null,null,null,null,null,null,null,null,null,null,null,null,null,null,null,null,null,{"$f":"SUM(AG3:AG1048576)","v":{"$error":"#REF!"}}]
[]
[]
[null,null,null,"Premissas"]
[]
[]
[null,"2.1 Conversores de unidades"]
[null,null,"Conversão de Energia","joule  ","kilowatt-hora  ","Caloria (kcal IT)  ","BTU (IT)  "]
[null,null,"1 J  ",1,2.7777799999999999E-7,2.3884589999999999E-4,9.4781710000000003E-4]
[null,null,"1 kWh  ",3600000,1,859.84522786000002,3412.1416331]
[null,null,"1 kcal (IT)  ",4186.8,1.163E-3,1,3.9683207192999999]
[null,null,"1 BTU (IT)  ",1055.0558526,2.9307109999999998E-4,0.25199576109999999,1]
[]
[null,"2.2 Premissas adicionais",null,null,null,"Valores","Unidade"]
[null,null,null,null,"Fator de coprodução de O2 por eletrólise",8,"kg O2/kg H2"]
[null,null,null,null,"Densidade do O2",{"$f":"0.6998*293.15/273.15","v":0.75103924583562143},"kg/m3"]
[]
[null,"2.3 Lista de combustíveis"]
[null,null,"Combustível","Unidade comercial (S.I.)","Densidade (kg/m3)","Poder calorífico inferior (MJ/S.I.)","Fator de emissão (ton CO2eq/TJ)"]
[null,null,"H2","kg",8.3752093802345065E-2,119.87999999999998,0]
[null,null,"Gás Natural","m3",0.74,36.843839999999993,56.152000000000001]
[null,null,"Carvão","kg","n/a",26.7,98.974999999999994]
[null,null,"Óleo combustível","m3",1000,40151.412000000004,77.796000000000006]
[null,null,"Coque de petróleo","kg",1040,35.127251999999999,97.896000000000001]
[null,null,"Outro"]
[]
[]
[]
[]
[]
[]
[]
[]
[]
[]
[]
[]
[]
[]
[]
[]
[]
[]
[]
[]
[]
[]
[]
[]
[]
[]
[]
[]
[]
[]
[]
[]
[]
[]
[]
[]
[]
[]
[]
[]
[]
[]
[]
[null,null,null,null,null,null,null,null,null,null,null,null,null,null,null,null,null,null,null,null,null,null,null,null,null,null,null,null,null,null,null,null,{"$f":"#REF!-#REF!","v":{"$error":"#REF!"}}]

{"sheet":"(3) Eletrolisadores","index":2,"n_rows":14,"n_cols":12,"rows_kept":14,"cut":false,"hidden":false,"merged":[]}
[]
[null,"3. Eletrolisadores"]
[]
[null,null,"Modelo","Fabricante","Tecnologia","Pressão de saída [bar]","Potência [kW]","Capacidade de produção [kg/h]","Consumo de energia [kWh/kgH2]","Capacidade específica [Nm3/h/kW]","Capacidade específica [kg/h/kW]","Consumo de água [L/kg H2]"]
[null,null,"(20 MW) HyLYZER® -4.000-30","Cummins","PEM",30,20000,330.8,51,0.2,1.6539999999999999E-2,16.9286578]
[null,null,"(5 MW) HyLYZER® -1.000-30","Cummins","PEM",30,5000,82.7,51.995163239999997,0.2,1.6539999999999999E-2,16.9286578]
[null,null,"(2.5 MW) HyLYZER® -500-30","Cummins","PEM",30,2500,41.35,61.668681980000002,0.2,1.6539999999999999E-2,16.9286578]
[null,null,"(1.25 MW) SiLYZER 200","Siemens","PEM",35,1250,18.607500000000002,62,0.18,1.4886E-2,12.091898430000001]
[null,null,"(1.25 MW) SiLYZER 300","Siemens","PEM",35,1250,18.607500000000002,62,0.18,1.4886E-2,10]
[null,null,"(0.5 MW) HySTAT® - 100","Cummins","ALK",10,500,8.27,57.5,0.2,1.6539999999999999E-2,15]
[null,null,"(0.45 MW) HyProvide - A90","Green Hydrogen","ALK",35,450,8.1,53.6,0.2,1.6539999999999999E-2,10.88270859]
[null,null,"(19.4 MW) Nel A3880","Nel Hydrogen","ALK","1-200",19400,320.87599999999998,53.204353079999997,0.2,1.6539999999999999E-2,10.88270859]
[null,null,"(20 MW) Nel M4000","Nel Hydrogen","PEM",30,20000,330.8,54.776299880000003,0.2,1.6539999999999999E-2,10.88270859]
[null,null,"(2.07 MW) HGAS3SP","ITM Power","PEM",30,2070,36,57.5,0.2,1.7399999999999999E-2,25]

{"sheet":"(4) Entrada de dados","index":3,"n_rows":116,"n_cols":33,"rows_kept":116,"cut":false,"hidden":false,"merged":[]}
[]
[null,"4. Entradas",null,null,null,null,null,null,null,null,null,null,null,null,null,null,null,null,null,null,null,null,null,null,null,null,null,null,null,null,null,null,{"$f":"SUM(AG3:AG1048576)","v":0}]
[]
[]
[null,null,null,"Conjecturas: Produção de Hidrogênio Verde"]
[]
[null,null,"Código de Cores"]
[null,null,"Informativo"]
[null,null,"Dados de entrada"]
[]
[]
[]
[null,null,"4.1 Diagnóstico e análise preliminar",null,null,"Valor","Unidade","Descrição"]
[null,null,null,null,"Combustível ou fonte fóssil","Gás Natural",null,"Selecionar o combustível fóssil a ser substituído dentro da lista. Caso deseje utilizar outro combustível, a unidade comercial (m3 ou kg), o equivalente energético (MJ/unidade comercial) e o fator de emissão (ton CO2eq/TJ) da fonte devem ser fornecidos nos campos abaixo"]
[null,null,null,null,{"$f":"\"Consumo anual de \"&F14","v":"Consumo anual de Gás Natural"},20000000,{"$f":"INDEX('(2) Premissas'!D21:D25,MATCH('(4) Entrada de dados'!F14,'(2) Premissas'!C21:C25,0))","v":"m3"},"Definir o consumo total anual de combustível fóssil sendo utilizado em um processo, conforme a unidade comercial indicada ao lado"]
[null,null,null,null,"Equivalente energético",{"$f":"INDEX('(2) Premissas'!F21:F25,MATCH('(4) Entrada de dados'!F14,'(2) Premissas'!C21:C25,0))","v":36.843839999999993},{"$f":"\"MJ/\"&Unidade_fonte_substituida","v":"MJ/m3"},"Poder calorífico do combustível selecionado (captado na lista de combustíveis), a ser utilizado na simulação"]
[null,null,null,null,"Fator de emissão",{"$f":"INDEX('(2) Premissas'!G21:G25,MATCH('(4) Entrada de dados'!F14,'(2) Premissas'!C21:C25,0))","v":56.152000000000001},"tonCO2eq/TJ","Fator de emissão do combustível selecionado (captado na lista de combustíveis), a ser utilizado na simulação"]
[null,null,null,null,{"$f":"\"Consumo de energia associado ao uso de \"&F14","v":"Consumo de energia associado ao uso de Gás Natural"},{"$f":"Consumo_FonteFossil*F16*10^-6","v":736.87679999999989},"TJ/ano","Resultado da energia consumida, associado ao combustível selecionado"]
[null,null,null,null,{"$f":"\"Emissões de CO2 associadas ao uso de \"&F14","v":"Emissões de CO2 associadas ao uso de Gás Natural"},{"$f":"F18*fator_emissao_fonte_substituida","v":41377.106073599993},"ton CO2eq/ano","Resultado das emissões de CO2 que o processo proporciona"]
[null,null,null,null,"Substituição desejada da fonte fóssil",0.05,"(-)","Definir o quanto da energia consumida atualmente se deseja ou poder ser substituído por H2"]
[null,null,null,null,{"$f":"\"A substituição reduzirá o consumo de \"&F14&\" em\"","v":"A substituição reduzirá o consumo de Gás Natural em"},{"$f":"F20*F18","v":36.843839999999993},"TJ/ano","Resultado de quanto da energia sera substituída pelo uso de H2"]
[null,null,null,null,"As emissões evitadas, segundo a substituição, seriam de",{"$f":"F21*fator_emissao_fonte_substituida","v":2068.8553036799995},"ton CO2eq/ano","Resultado da redução de emissões esperada ao deixar de utilizar a fonte fóssil tradicional"]
[null,null,null,null,"Uso de H2 sustentável para promover a substituição",{"$f":"F21/(PCI_H2/10^3)","v":307.33933933933929},"ton H2/ano","Resultado da quantidade de H2 sustentável seria necessário para realizar a substituição"]
[null,null,null,null,"Capacidade de eletrólise sugerida para atender a substituição",{"$f":"F23*62/365/24","v":2.1752327670135885},"MW","Sugestão da capacidade instalada de eletrólise para se iniciar a avaliação. Considera-se o uso de 100% da capacidade de um eletrolisador, com uma eficiência de 62 kWh/kg. Esse valor pode ser utilizado como referência para a seleção do eletrolisador do projeto."]
[]
[null,null,"4.2 Preços e custos de insumos",null,null,"Valor","Unidade","Descrição"]
[null,null,null,null,"Moeda","BRL",null,"Moeda adotada para as entradas de preços e custos"]
[null,null,null,null,{"$f":"\"Custo do \"&F14&\"\"","v":"Custo do Gás Natural"},4,{"$f":"Moeda&\"/\"&Unidade_fonte_substituida","v":"BRL/m3"},"Custo da fonte fóssil atualmente utilizada, relacionado ao ganho virtual de receita ao se evitar o uso da fonte fóssil, devido ao uso do H2 como substituto"]
[null,null,null,null,"Custo da água consumida pelo eletrolisador",0.6,{"$f":"Moeda&\"/m3\"","v":"BRL/m3"},"Custo associado ao consumo específico de H2O para o eletrolisador produzir H2 e O2"]
[null,null,null,null,"Preço de oportunidade para o O2",0,{"$f":"Moeda&\"/m3\"","v":"BRL/m3"},"Preço de ganho de receita pelo O2 por meios comerciais ou outras oportunidades consideradas pelo projetista (redução de compra de matéria-prima, redução de consumo de combustível recorrendo à queima com atmosfera enriquecida)"]
[null,null,null,null,"Custo da energia elétrica",150,{"$f":"Moeda&\"/MWh\"","v":"BRL/MWh"},"Custo associado a energia elétrica acessível à fábrica"]
[null,null,null,null,"Preço do crédito de carbono",0,{"$f":"Moeda&\"/ton CO2\"","v":"BRL/ton CO2"},"Preço representativo do crédito de carbono, acessível em mercados regulados ou voluntários"]
[]
[null,null,"4.3 Condições operacionais do projeto",null,null,"Valor","Unidade","Descrição"]
[null,null,null,null,"Fator Operacional",1,"(-)","Expectativa de operação do projeto, aplicável sobre o fator de capacidade do eletrolisador e a operação da fábrica"]
[null,null,null,null,"Total de horas trabalhadas em um ano",8760,"h","Total de horas em que a operação ocorre em 1 ano"]
[null,null,null,null,"Período de investimento",2,"anos","Inserir valores entre 1 e 5. Este campo determina o ano em que o projeto entra em operação (ex: incidência de montantes financeiros operacionais)"]
[null,null,null,null,"Taxa de Desconto",0.05,"a.a.","Taxa de desconto real aplicável sobre os montantes financeiros incidentes no fluxo de caixa"]
[]
[null,null,"4.4 Seção de eletrolisadores",null,null,null,null,"Descrição"]
[null,null,null,null,"Custo unitário do eletrolisador por unidade de potência instalada",7261,{"$f":"Moeda&\"/kW\"","v":"BRL/kW"},"Custo unitário do eletrolisador, por unidade de potência instalada do eletrolisador."]
[null,null,null,null,"Taxa de degradação do eletrolisador",0.01,"a.a.","Redução da capacidade do eletrolisador de produzir H2, utilizando-se do mesmo consumo de energia elétrica"]
[]
[null,null,"4.5 Seleção de eletrolisadores - utilizar lista existente de eletrolisadores ou introduzir um eletrolisador com suas especificações técnicas",null,null,null,null,null,null,null,null,null,null,null,"Valores anuais"]
[null,null,"Qtd","Modelo","Fabricante","Tecnologia","Pressão de saída [bar]","Potência [kW]","Capacidade de produção [kg/h]","Consumo de energia [kWh/kgH2]","Capacidade específica [Nm3/h/kW]","Capacidade específica [kg/h/kW]","Consumo de água [L/kg H2]","Custo do eletrolisador","Produção H2 [ton/ano]","Produção O2 [ton/ano]","Consumo água [m3/ano]","Consumo de energia elétrica [MWh/ano]","Descrição"]
[null,null,0,"(2.5 MW) HyLYZER® -500-30",{"$f":"VLOOKUP($D$46,'(3) Eletrolisadores'!$C$4:$L$14,(COUNTA($D$46:D46)+1),0)","v":"Cummins"},{"$f":"VLOOKUP($D$46,'(3) Eletrolisadores'!$C$4:$L$14,(COUNTA($D$46:E46)+1),0)","v":"PEM"},{"$f":"VLOOKUP($D$46,'(3) Eletrolisadores'!$C$4:$L$14,(COUNTA($D$46:F46)+1),0)","v":30},{"$f":"VLOOKUP($D$46,'(3) Eletrolisadores'!$C$4:$L$14,(COUNTA($D$46:G46)+1),0)","v":2500},{"$f":"VLOOKUP($D$46,'(3) Eletrolisadores'!$C$4:$L$14,(COUNTA($D$46:H46)+1),0)","v":41.35},{"$f":"VLOOKUP($D$46,'(3) Eletrolisadores'!$C$4:$L$14,(COUNTA($D$46:I46)+1),0)","v":61.668681980000002},{"$f":"VLOOKUP($D$46,'(3) Eletrolisadores'!$C$4:$L$14,(COUNTA($D$46:J46)+1),0)","v":0.2},{"$f":"VLOOKUP($D$46,'(3) Eletrolisadores'!$C$4:$L$14,(COUNTA($D$46:K46)+1),0)","v":1.6539999999999999E-2},{"$f":"VLOOKUP($D$46,'(3) Eletrolisadores'!$C$4:$L$14,(COUNTA($D$46:L46)+1),0)","v":16.9286578},{"$f":"Custo.Uni_ELET*H46*C46","v":0},{"$f":"I46*TDT*Fator_Operacional/10^3*C46","v":0},{"$f":"I46*O2_kg_por_H2_kg*TDT*Fator_Operacional/10^3*C46","v":0},{"$f":"-M46*I46*TDT*Fator_Operacional/10^3*C46","v":0},{"$f":"-J46*I46*TDT*Fator_Operacional/10^3*C46","v":0},"Selecione um eletrolisador na lista, bem como a quantidade desejada."]
[null,null,1,"(5 MW) HyLYZER® -1.000-30",{"$f":"VLOOKUP($D$47,'(3) Eletrolisadores'!$C$4:$L$14,(COUNTA($D$47:D47)+1),0)","v":"Cummins"},{"$f":"VLOOKUP($D$47,'(3) Eletrolisadores'!$C$4:$L$14,(COUNTA($D$47:E47)+1),0)","v":"PEM"},{"$f":"VLOOKUP($D$47,'(3) Eletrolisadores'!$C$4:$L$14,(COUNTA($D$47:F47)+1),0)","v":30},{"$f":"VLOOKUP($D$47,'(3) Eletrolisadores'!$C$4:$L$14,(COUNTA($D$47:G47)+1),0)","v":5000},{"$f":"VLOOKUP($D$47,'(3) Eletrolisadores'!$C$4:$L$14,(COUNTA($D$47:H47)+1),0)","v":82.7},{"$f":"VLOOKUP($D$47,'(3) Eletrolisadores'!$C$4:$L$14,(COUNTA($D$47:I47)+1),0)","v":51.995163239999997},{"$f":"VLOOKUP($D$47,'(3) Eletrolisadores'!$C$4:$L$14,(COUNTA($D$47:J47)+1),0)","v":0.2},{"$f":"VLOOKUP($D$47,'(3) Eletrolisadores'!$C$4:$L$14,(COUNTA($D$47:K47)+1),0)","v":1.6539999999999999E-2},{"$f":"VLOOKUP($D$47,'(3) Eletrolisadores'!$C$4:$L$14,(COUNTA($D$47:L47)+1),0)","v":16.9286578},{"$f":"Custo.Uni_ELET*H47*C47","v":36305000},{"$f":"I47*TDT*Fator_Operacional/10^3*C47","v":724.452},{"$f":"I47*O2_kg_por_H2_kg*TDT*Fator_Operacional/10^3*C47","v":5795.616},{"$f":"-M47*I47*TDT*Fator_Operacional/10^3*C47","v":-12264.000000525601},{"$f":"-J47*I47*TDT*Fator_Operacional/10^3*C47","v":-37667.999999544481},"Selecione um eletrolisador na lista, bem como a quantidade desejada."]
[null,null,0,"Outro","A","B",30,2500,41.35,50,null,null,10,{"$f":"Custo.Uni_ELET*H48*C48","v":0},{"$f":"I48*TDT*Fator_Operacional/10^3*C48","v":0},{"$f":"I48*O2_kg_por_H2_kg*TDT*Fator_Operacional/10^3*C48","v":0},{"$f":"-M48*I48*TDT*Fator_Operacional/10^3*C48","v":0},{"$f":"-J48*I48*TDT*Fator_Operacional/10^3*C48","v":0},"Este espaço permite ao usuário considerar um eletrolisador ausente na lista sugerida. Os espaços com fundo cinza destacam valores introduzidos na simulação, portanto devem ser preenchidos"]
[null,null,null,null,null,null,"Sumário do sistema de eletrólise",{"$f":"SUMPRODUCT(H46:H48,C46:C48)","v":5000},{"$f":"SUMPRODUCT(I46:I48,C46:C48)","v":82.7},{"$f":"(I46*J46+I48*J48)/SUM(I46:I48)","v":27.917170495000001},{"$f":"L49/Densidade_H2","v":0.19748759999999999},{"$f":"I49/H49","v":1.6539999999999999E-2},{"$f":"SUMPRODUCT(M46:M48,O46:O48)/SUM(O46:O48)","v":16.9286578},{"$f":"SUM(N46:N48)","v":36305000},{"$f":"SUM(O46:O48)","v":724.452},{"$f":"SUM(P46:P48)","v":5795.616},{"$f":"SUM(Q46:Q48)","v":-12264.000000525601},{"$f":"SUM(R46:R48)","v":-37667.999999544481},"Os resultados neste sumário serão utilizados na simulação"]
[null,null,null,null,null,"Alerta de alinhamento com a concepção inicial:","A potência instalada é",{"$f":"TRUNC(H49/F24/1000-1,1)","v":1.2},{"$f":"IF(H50>0,\"maior que a sugestão do diagnóstico\",\"menor que a sugestão do diagnóstico\")","v":"maior que a sugestão do diagnóstico"}]
[]
[null,null,"4.6 Custos de capital e operacionais do eletrolisador "]
[null,null,null,null,"Orçamento de Investimento","Valor","Moeda","% do Eletrolisador",null,"Custos de Operação  ",null,"Valor","Moeda","% do Eletrolisador","Periodicidade"]
[null,null,null,null,"Eletrolisadores  ",{"$f":"-N49","v":-36305000},{"$f":"Moeda","v":"BRL"},"(-)",null,null,"Operação e Manutenção  ",{"$f":"N54*$F$54","v":-907625},{"$f":"Moeda","v":"BRL"},2.5000000000000001E-2,"a.a."]
[null,null,null,null,"Armazenamento de H2  ",{"$f":"H55*$F$54","v":0},"BRL",0,null,null,"Outros custos  ",{"$f":"N55*$F$54","v":-907625},{"$f":"Moeda","v":"BRL"},2.5000000000000001E-2,"a.a."]
[null,null,null,null,"Armazenamento de O2  ",0,"BRL",0,null,null,"Demais custos",null,{"$f":"Moeda","v":"BRL"},"(-)","a.a."]
[null,null,null,null,"Importação equipamento  ",-5445750,"BRL",0.15,null,null,"Troca da membrana  ",{"$f":"N57*$F$54","v":-7261000},{"$f":"Moeda","v":"BRL"},0.2,75000,"horas"]
[null,null,null,null,"Preparo do local: mão de obra  ",-3267450,"BRL",0.09]
[null,null,null,null,"Preparo do local: material  ",-3630500,"BRL",0.1]
[null,null,null,null,"Engenharia e licenciamento  ",-363050,"BRL",0.01,null,"Valores Residuais  "]
[null,null,null,null,"Outras contingências  ",-5445750,"BRL",0.15,null,null,"Valor residual no último ano  ",{"$f":"-F54*N61","v":10757037.037037037},{"$f":"Moeda","v":"BRL"},{"$f":"(27-21+posterga)/27","v":0.29629629629629628}]
[null,null,null,null,"Demais custos",0,"BRL","(-)"]
[]
[null,null,null,null,"Investimento no sistema de eletrólise",{"$f":"SUM(F54:F63)","v":-54457500},"BRL","Cálculo do investimento do eletrolisador"]
[null,null,null,null,"CAPEX do eletrolisador",{"$f":"F64","v":-54457500},"BRL","CAPEX a ser utilizado no fluxo de caixa. Neste campo pode ser inserido o valor do CAPEX que se deseja considerar na simulação"]
[]
[]
[]
[]
[]
[]
[]
[]
[]
[]
[null,null,"Análise de sensibilidade - Esta seção deve ficar oculta para fins de se concentrar os resultados na Aba adequada. A análise de sensibilidade está construída nesta parte, pois as variáveis e a Tabela de Dados (ferramenta utilizada do Excel) devem estar contidas em uma mesma Aba"]
[]
[]
[null,null,null,null,"VPL",{"$f":"E28","v":"Custo do Gás Natural"},{"$f":"G28","v":"BRL/m3"}]
[null,null,null,null,{"$f":"'(6) Resultados'!E9","v":-38477.218064217079},{"$f":"'(7) Análise de sensibilidade'!H16","v":0},{"$f":"'(7) Análise de sensibilidade'!I16","v":0.8},{"$f":"'(7) Análise de sensibilidade'!J16","v":1.6},{"$f":"'(7) Análise de sensibilidade'!K16","v":2.4000000000000004},{"$f":"'(7) Análise de sensibilidade'!L16","v":3.2},{"$f":"'(7) Análise de sensibilidade'!M16","v":4},{"$f":"'(7) Análise de sensibilidade'!N16","v":4.8},{"$f":"'(7) Análise de sensibilidade'!O16","v":5.6},{"$f":"'(7) Análise de sensibilidade'!P16","v":6.3999999999999995},{"$f":"'(7) Análise de sensibilidade'!Q16","v":7.1999999999999993}]
[null,null,null,{"$f":"E31","v":"Custo da energia elétrica"},{"$f":"'(7) Análise de sensibilidade'!G17","v":0},-78193.603141654254,-57243.758522268785,-36293.913902883331,-15344.069283497873,5605.7753358875925,26555.61995527304,47505.464574658501,68455.309194043919,89405.153813429381,110354.99843281481]
[null,null,null,{"$f":"G31","v":"BRL/MWh"},{"$f":"'(7) Análise de sensibilidade'!G18","v":30},-91200.170745552285,-70250.326126166809,-49300.481506781362,-28350.636887395896,-7400.7922680104457,13549.052351374994,34498.896970760456,55448.741590145917,76398.586209531364,97348.430828916811]
[null,null,null,null,{"$f":"'(7) Análise de sensibilidade'!G19","v":60},-104206.73834945029,-83256.893730064825,-62307.049110679363,-41357.204491293909,-20407.359871908462,542.48474747698492,21492.329366862432,42442.173986247901,63392.018605633333,84341.863225018809]
[null,null,null,null,{"$f":"'(7) Análise de sensibilidade'!G20","v":90},-117213.3059533483,-96263.461333962856,-75313.616714577394,-54363.772095191925,-33413.927475806478,-12464.082856421035,8485.7617629644228,29435.60638234987,50385.451001735317,71335.295621120749]
[null,null,null,null,{"$f":"'(7) Análise de sensibilidade'!G21","v":120},-130219.87355724633,-109270.02893786089,-88320.184318475425,-67370.339699089964,-46420.495079704517,-25470.650460319062,-4520.8058409336154,16429.038778451839,37378.883397837286,58328.728017222747]
[null,null,null,null,{"$f":"'(7) Análise de sensibilidade'!G22","v":150},-143226.44116114435,-122276.5965417589,-101326.75192237346,-80376.90730298798,-59427.062683602533,-38477.218064217079,-17527.373444831621,3422.4711745538152,24372.315793939269,45322.160413324731]
[null,null,null,null,{"$f":"'(7) Análise de sensibilidade'!G23","v":180},-156233.00876504241,-135283.16414565692,-114333.31952627144,-93383.474906885996,-72433.630287500549,-51483.785668115102,-30533.941048729648,-9584.0964293442012,11365.74819004126,32315.592809426686]
[null,null,null,null,{"$f":"'(7) Análise de sensibilidade'!G24","v":210},-169239.57636894041,-148289.73174955492,-127339.88713016946,-106390.04251078401,-85440.197891398537,-64490.353272013112,-43540.50865262765,-22590.664033242207,-1640.819413856756,19309.025205528691]
[null,null,null,null,{"$f":"'(7) Análise de sensibilidade'!G25","v":240},-182246.14397283847,-161296.29935345298,-140346.45473406755,-119396.61011468204,-98446.765495296597,-77496.92087591115,-56547.076256525695,-35597.231637140256,-14647.387017754801,6302.4576016306528]
[null,null,null,null,{"$f":"'(7) Análise de sensibilidade'!G26","v":270},-195252.71157673644,-174302.86695735093,-153353.02233796549,-132403.17771858006,-111453.3330991946,-90503.488479809166,-69553.643860423705,-48603.799241038258,-27653.954621652796,-6704.1100022673563]
[]
[null,null,null,null,"VPL",{"$f":"E28","v":"Custo do Gás Natural"},{"$f":"G28","v":"BRL/m3"}]
[null,null,null,null,{"$f":"'(6) Resultados'!E9","v":-38477.218064217079},{"$f":"'(7) Análise de sensibilidade'!H31","v":0},{"$f":"'(7) Análise de sensibilidade'!I31","v":0.8},{"$f":"'(7) Análise de sensibilidade'!J31","v":1.6},{"$f":"'(7) Análise de sensibilidade'!K31","v":2.4000000000000004},{"$f":"'(7) Análise de sensibilidade'!L31","v":3.2},{"$f":"'(7) Análise de sensibilidade'!M31","v":4},{"$f":"'(7) Análise de sensibilidade'!N31","v":4.8},{"$f":"'(7) Análise de sensibilidade'!O31","v":5.6},{"$f":"'(7) Análise de sensibilidade'!P31","v":6.3999999999999995},{"$f":"'(7) Análise de sensibilidade'!Q31","v":7.1999999999999993}]
[null,null,null,{"$f":"E41","v":"Custo unitário do eletrolisador por unidade de potência instalada"},{"$f":"'(7) Análise de sensibilidade'!G32","v":0},-65117.531948078285,-44167.687328692831,-23217.842709307373,-2267.9980899219086,18681.846529463539,39631.691148848993,60581.53576823444,81531.380387619894,102481.22500700534,123431.06962639082]
[null,null,null,{"$f":"G41","v":"BRL/kW"},{"$f":"'(7) Análise de sensibilidade'!G33","v":1452.2},-80739.313790691478,-59789.469171306031,-38839.624551920577,-17889.779932535115,3060.0646868503336,24009.909306235779,44959.753925621233,65909.598545006695,86859.443164392156,107809.28778377759]
[null,null,null,null,{"$f":"'(7) Análise de sensibilidade'!G34","v":2904.4},-96361.095633304736,-75411.25101391926,-54461.406394533806,-33511.561775148337,-12561.71715576289,8388.1274636225571,29337.972083008004,50287.816702393458,71237.661321778898,92187.505941164331]
[null,null,null,null,{"$f":"'(7) Análise de sensibilidade'!G35","v":4356.6000000000004},-111982.87747591792,-91033.032856532474,-70083.188237146998,-49133.343617761551,-28183.498998376101,-7233.65437899065,13716.190240394808,34666.034859780251,55615.879479165669,76565.724098551116]
[null,null,null,null,{"$f":"'(7) Análise de sensibilidade'!G36","v":5808.8},-127604.65931853115,-106654.8146991457,-85704.970079760242,-64755.125460374766,-43805.280840989319,-22855.436221603879,-1905.5916022184247,19044.253017167015,39994.097636552498,60943.942255937916]
[null,null,null,null,{"$f":"'(7) Análise de sensibilidade'!G37","v":7261},-143226.44116114435,-122276.5965417589,-101326.75192237346,-80376.90730298798,-59427.062683602533,-38477.218064217079,-17527.373444831621,3422.4711745538152,24372.315793939269,45322.160413324731]
[null,null,null,null,{"$f":"'(7) Análise de sensibilidade'!G38","v":8713.2000000000007},-158848.22300375756,-137898.3783843721,-116948.53376498664,-95998.689145601209,-75048.844526215733,-54098.999906830293,-33149.155287444839,-12199.310668059392,8750.5339513260624,29700.37857071148]
[null,null,null,null,{"$f":"'(7) Análise de sensibilidade'!G39","v":10165.400000000001},-174470.00484637081,-153520.16022698535,-132570.31560759988,-111620.47098821442,-90670.626368828962,-69720.781749443529,-48770.937130058075,-27821.092510672635,-6871.2478912871666,14078.596728098266]
[null,null,null,null,{"$f":"'(7) Análise de sensibilidade'!G40","v":11617.600000000002},-190091.78668898402,-169141.94206959859,-148192.09745021313,-127242.25283082764,-106292.40821144221,-85342.563592056773,-64392.718972671304,-43442.874353285864,-22493.029733900403,-1543.1851145149703]
[null,null,null,null,{"$f":"'(7) Análise de sensibilidade'!G41","v":13069.800000000003},-205713.56853159724,-184763.72391221178,-163813.87929282634,-142864.03467344088,-121914.19005405541,-100964.34543466997,-80014.500815284511,-59064.656195899064,-38114.811576513603,-17164.96695712817]
[]
[null,null,null,null,"VPL",{"$f":"E28","v":"Custo do Gás Natural"},{"$f":"G28","v":"BRL/m3"}]
[null,null,null,null,{"$f":"'(6) Resultados'!E9","v":-38477.218064217079},{"$f":"'(7) Análise de sensibilidade'!H46","v":0},{"$f":"'(7) Análise de sensibilidade'!I46","v":0.8},{"$f":"'(7) Análise de sensibilidade'!J46","v":1.6},{"$f":"'(7) Análise de sensibilidade'!K46","v":2.4000000000000004},{"$f":"'(7) Análise de sensibilidade'!L46","v":3.2},{"$f":"'(7) Análise de sensibilidade'!M46","v":4},{"$f":"'(7) Análise de sensibilidade'!N46","v":4.8},{"$f":"'(7) Análise de sensibilidade'!O46","v":5.6},{"$f":"'(7) Análise de sensibilidade'!P46","v":6.3999999999999995},{"$f":"'(7) Análise de sensibilidade'!Q46","v":7.1999999999999993}]
[null,null,null,{"$f":"E38","v":"Taxa de Desconto"},{"$f":"'(7) Análise de sensibilidade'!G47","v":0},-200205.82256167076,-165703.31433427794,-131200.80610688517,-96698.29787949234,-62195.789652099542,-27693.281424706751,6809.2268026860402,41311.735030078824,75814.243257471622,110316.75148486442]
[null,null,null,{"$f":"G38","v":"a.a."},{"$f":"'(7) Análise de sensibilidade'!G48","v":0.01},-185569.44083636638,-154584.22057568707,-123599.0003150078,-92613.780054328468,-61628.559793649176,-30643.339532969872,341.88072770942381,31327.100988388716,62312.321249068002,93297.541509747301]
[null,null,null,null,{"$f":"'(7) Análise de sensibilidade'!G49","v":0.02},-172810.33207685006,-144872.42987777264,-116934.52767869526,-88996.625479617884,-61058.723280540507,-33120.821081463131,-5182.9188823857548,22754.983316691621,50692.885515768983,78630.787714846374]
[null,null,null,null,{"$f":"'(7) Análise de sensibilidade'!G50","v":0.03},-161649.439327762,-136361.40497055123,-111073.37061334046,-85785.336256129725,-60497.301898918966,-35209.267541708206,-9921.2331844974542,15366.801172713305,40654.835529924065,65942.869887134817]
[null,null,null,null,{"$f":"'(7) Análise de sensibilidade'!G51","v":0.04},-151853.38711745423,-128877.98706832319,-105902.58701919214,-82927.186970061099,-59951.786920930099,-36976.38687179907,-14000.986822668034,8974.413226462988,31949.813275594031,54925.213324725046]
[null,null,null,null,{"$f":"'(7) Análise de sensibilidade'!G52","v":0.05},-143226.44116114435,-122276.5965417589,-101326.75192237346,-80376.90730298798,-59427.062683602533,-38477.218064217079,-17527.373444831621,3422.4711745538152,24372.315793939269,45322.160413324731]
[null,null,null,null,{"$f":"'(7) Análise de sensibilidade'!G53","v":6.0000000000000005E-2},-135603.96883241256,-116434.50196098148,-97265.03508955038,-78095.568218119239,-58926.101346688141,-39756.634475257044,-20587.167603825943,-1417.7007323948274,17751.766139036277,36921.23301046736]
[null,null,null,null,{"$f":"'(7) Análise de sensibilidade'!G54","v":7.0000000000000007E-2},-128847.10595329944,-111247.95068356236,-93648.795413825253,-76049.640144088175,-58450.484874351096,-40851.329604614009,-23252.174334876931,-5653.0190651398516,11946.136204597235,29545.291474334299]
[null,null,null,null,{"$f":"'(7) Análise de sensibilidade'!G55","v":0.08},-122838.39580379092,-106628.99597397138,-90419.596144151816,-74210.196314332279,-58000.796484512728,-41791.396654693192,-25581.99682487364,-9372.5969950541039,6836.8028347654399,23046.202664584984]
[null,null,null,null,{"$f":"'(7) Análise de sensibilidade'!G56","v":0.09},-117478.21373890013,-102502.88866703646,-87527.563595172775,-72552.23852330909,-57576.913451445413,-42601.588379581743,-27626.263307718058,-12650.938235854384,2324.3868360092893,17299.711907872959]

{"sheet":"(5) Simulação e Fluxo de Caixa","index":4,"n_rows":68,"n_cols":34,"rows_kept":68,"cut":false,"hidden":false,"merged":[]}
[]
[null,"5. Simulação da produção de H2, fluxos físicos e fluxo de Caixa"]
[]
[]
[null,null,"5.1 Fluxos físicos",null,null,null,0,1,2,3,4,5,6,7,8,9,10,11,12,13,14,15,16,17,18,19,20,null,"Acumulado no tempo de vida",null,null,null,null,"Descrição do campo"]
[]
[null,null,"Rastreamento da substituição da membrana na tencologia PEM",null,null,null,null,null,null,null,null,null,null,null,null,null,null,null,null,null,null,null,null,null,null,null,null,null,null,null,null,null,null,{"$f":"C7","v":"Rastreamento da substituição da membrana na tencologia PEM"}]
[null,null,"Horas de uso do eletrolisador",null,{"$f":"'(4) Entrada de dados'!G36","v":"h"},null,{"$f":"IF(G5>=posterga,Fator_Operacional*TDT,0)","v":0},0,8760,8760,8760,8760,8760,8760,8760,8760,8760,8760,8760,8760,8760,8760,8760,8760,8760,8760,8760,null,{"$f":"SUM(G8:AA8)","v":166440},null,null,null,{"$f":"E8","v":"h"},{"$f":"C8","v":"Horas de uso do eletrolisador"}]
[null,null,"Horas acumuladas",null,{"$f":"'(4) Entrada de dados'!G36","v":"h"},null,{"$f":"G8+F9","v":0},{"$f":"H8+G9","v":0},{"$f":"I8+H9","v":8760},{"$f":"IF(I10,J8,J8+I9)","v":17520},26280,35040,43800,52560,61320,70080,78840,8760,17520,26280,35040,43800,52560,61320,70080,78840,8760,null,{"$f":"SUM(G9:AA9)","v":797160},null,null,null,{"$f":"E9","v":"h"},{"$f":"C9","v":"Horas acumuladas"}]
[null,null,"Troca membrana",null," ",null,{"$f":"IF(G9>=duracao_membrana,TRUE,FALSE)","v":false},false,false,false,false,false,false,false,false,false,true,false,false,false,false,false,false,false,false,true,false,null,"n/a",null,null,null,{"$f":"E10","v":" "},{"$f":"C10","v":"Troca membrana"}]
[]
[]
[null,null,"Produção (fluxos físicos relacionados a Receitas)",null,null,null,null,null,null,null,null,null,null,null,null,null,null,null,null,null,null,null,null,null,null,null,null,null,null,null,null,null,null,{"$f":"C13","v":"Produção (fluxos físicos relacionados a Receitas)"}]
[null,null,"Produção de Hidrogênio",null,"ton",null,{"$f":"IF(G5=posterga,Prod_H2,0)","v":0},{"$f":"IF(H5=posterga,Prod_H2,0)","v":0},{"$f":"IF(OR(I5=posterga,H10),Prod_H2,H14-(Degradacao_aa_EL*H14))","v":724.452},717.20748000000003,710.03540520000001,702.93505114799996,695.90570063652001,688.94664363015477,682.05717719385325,675.23660542191476,668.48423936769564,724.452,717.20748000000003,710.03540520000001,702.93505114799996,695.90570063652001,688.94664363015477,682.05717719385325,675.23660542191476,668.48423936769564,724.452,null,{"$f":"SUM(G14:AA14)","v":13254.972605196277},null,null,null,{"$f":"E14","v":"ton"},{"$f":"C14","v":"Produção de Hidrogênio"}]
[null,null,"Produção de Oxigênio",null,"milhares m3",null,{"$f":"IF(G5=posterga,Prod_O2*Volume.especifico_O2,0)","v":0},{"$f":"IF(H5=posterga,Prod_O2*Volume.especifico_O2,0)","v":0},{"$f":"IF(OR(I5=posterga,H10),Prod_O2*Volume.especifico_O2,H15-(Degradacao_aa_EL*H15))","v":4352.7350697928605},4309.2077190949321,4266.1156419039826,4223.4544854849428,4181.2199406300933,4139.4077412237921,4098.0136638115546,4057.0335271734389,4016.4631919017047,4352.7350697928605,4309.2077190949321,4266.1156419039826,4223.4544854849428,4181.2199406300933,4139.4077412237921,4098.0136638115546,4057.0335271734389,4016.4631919017047,4352.7350697928605,null,{"$f":"SUM(G15:AA15)","v":79640.037031827465},null,null,null,{"$f":"E15","v":"milhares m3"},{"$f":"C15","v":"Produção de Oxigênio"}]
[]
[]
[null,null,"Cálculo de insumos evitados (fluxos físicos relacionados a Receitas)",null,null,null,null,null,null,null,null,null,null,null,null,null,null,null,null,null,null,null,null,null,null,null,null,null,null,null,null,null,null,{"$f":"C18","v":"Cálculo de insumos evitados (fluxos físicos relacionados a Receitas)"}]
[null,null,{"$f":"\"Consumo corrente de \"&'(4) Entrada de dados'!F14","v":"Consumo corrente de Gás Natural"},null,{"$f":"Unidade_fonte_substituida","v":"m3"},null,{"$f":"IF(G5>=posterga,-Consumo_FonteFossil,0)","v":0},0,-20000000,-20000000,-20000000,-20000000,-20000000,-20000000,-20000000,-20000000,-20000000,-20000000,-20000000,-20000000,-20000000,-20000000,-20000000,-20000000,-20000000,-20000000,-20000000,null,{"$f":"SUM(G19:AA19)","v":-380000000},null,null,null,{"$f":"E19","v":"m3"},{"$f":"C19","v":"Consumo corrente de Gás Natural"}]
[null,null,{"$f":"\"Consumo corrente de \"&'(4) Entrada de dados'!F14","v":"Consumo corrente de Gás Natural"},null,"TJ",null,{"$f":"PCI_fonte_substituida*G19/10^6","v":0},0,-736.87679999999989,-736.87679999999989,-736.87679999999989,-736.87679999999989,-736.87679999999989,-736.87679999999989,-736.87679999999989,-736.87679999999989,-736.87679999999989,-736.87679999999989,-736.87679999999989,-736.87679999999989,-736.87679999999989,-736.87679999999989,-736.87679999999989,-736.87679999999989,-736.87679999999989,-736.87679999999989,-736.87679999999989,null,{"$f":"SUM(G20:AA20)","v":-14000.659199999998},null,null,null,{"$f":"E20","v":"TJ"},{"$f":"C20","v":"Consumo corrente de Gás Natural"}]
[null,null,{"$f":"\"Consumo de \"&'(4) Entrada de dados'!F14&\" sendo substituído por H2\"","v":"Consumo de Gás Natural sendo substituído por H2"},null,"TJ",null,{"$f":"G14*PCI_H2/10^3","v":0},0,86.847305759999983,85.978832702399984,85.119044375375992,84.267853931622213,83.425175392306002,82.590923638382947,81.76501440199911,80.947364257979132,80.137890615399343,86.847305759999983,85.978832702399984,85.119044375375992,84.267853931622213,83.425175392306002,82.590923638382947,81.76501440199911,80.947364257979132,80.137890615399343,86.847305759999983,null,{"$f":"SUM(G21:AA21)","v":1589.0061159109298},null,null,null,{"$f":"E21","v":"TJ"},"Energia que a produção total de H2 proporciona em substituição ao gás natural"]
[null,null,{"$f":"\"Consumo de \"&'(4) Entrada de dados'!F14&\" sendo substituído por H2\"","v":"Consumo de Gás Natural sendo substituído por H2"},null,{"$f":"Unidade_fonte_substituida","v":"m3"},null,{"$f":"G21/(PCI_fonte_substituida/10^6)","v":0},0,2357173.0243101697,2333601.294067068,2310265.2811263977,2287162.628315133,2264291.0020319819,2241648.0920116622,2219231.6110915458,2197039.2949806303,2175068.9020308242,2357173.0243101697,2333601.294067068,2310265.2811263977,2287162.628315133,2264291.0020319819,2241648.0920116622,2219231.6110915458,2197039.2949806303,2175068.9020308242,2357173.0243101697,null,{"$f":"SUM(G22:AA22)","v":43128135.284240998},null,null,null,{"$f":"E22","v":"m3"},"Consumo de Gás Natural sendo substituído por H2"]
[null,null,{"$f":" \"Percentual de substituição de \"&'(4) Entrada de dados'!F14&\" por H2 (base energética)\"","v":"Percentual de substituição de Gás Natural por H2 (base energética)"},null,"%",null,{"$f":"IFERROR(G22/ABS(G19),\"\")","v":""},{"$f":"IFERROR(H22/ABS(H19),\"\")","v":""},{"$f":"IFERROR(I22/ABS(I19),\"\")","v":0.11785865121550848},{"$f":"IFERROR(J22/ABS(J19),\"\")","v":0.1166800647033534},0.11551326405631988,0.11435813141575665,0.1132145501015991,0.11208240460058311,0.11096158055457729,0.10985196474903151,0.10875344510154121,0.11785865121550848,0.1166800647033534,0.11551326405631988,0.11435813141575665,0.1132145501015991,0.11208240460058311,0.11096158055457729,0.10985196474903151,0.10875344510154121,0.11785865121550848,null,{"$f":"IFERROR(AC22/ABS(AC19),\"\")","v":0.11349509285326578},null,null,null,"%",{"$f":"\"Esse resultado demonstra a perfomance do projeto frente ao objetivo de se substituir \"&'(4) Entrada de dados'!F20*100&\"% (em base energética) da fonte fóssil por H2\"","v":"Esse resultado demonstra a perfomance do projeto frente ao objetivo de se substituir 5% (em base energética) da fonte fóssil por H2"}]
[null,null,"Consumo efetivo de Gás Natural na aplicação final utilizando H2",null,{"$f":"Unidade_fonte_substituida","v":"m3"},null,{"$f":"G19+G22","v":0},{"$f":"H19+H22","v":0},{"$f":"I19+I22","v":-17642826.975689828},-17666398.70593293,-17689734.718873601,{"$f":"L19+L22","v":-17712837.371684868},-17735708.997968018,-17758351.90798834,-17780768.388908453,-17802960.70501937,-17824931.097969174,-17642826.975689828,-17666398.70593293,-17689734.718873601,-17712837.371684868,-17735708.997968018,-17758351.90798834,-17780768.388908453,-17802960.70501937,-17824931.097969174,-17642826.975689828,null,{"$f":"SUM(G24:AA24)","v":-336871864.71575898},null,null,null,"m3","Consumo efetivo de Gás Natural na aplicação final utilizando H2"]
[null,null,"Consumo efetivo de Gás Natural na aplicação final utilizando H2",null,"TJ",null,{"$f":"G24*PCI_fonte_substituida/10^6","v":0},0,-650.02949423999974,-650.89796729759985,-651.75775562462377,{"$f":"L24*PCI_fonte_substituida/10^6","v":-652.60894606837769},-653.45162460769393,-654.28587636161694,-655.11178559800067,-655.9294357420207,-656.73890938460056,-650.02949423999974,-650.89796729759985,-651.75775562462377,-652.60894606837769,-653.45162460769393,-654.28587636161694,-655.11178559800067,-655.9294357420207,-656.73890938460056,-650.02949423999974,null,{"$f":"SUM(G25:AA25)","v":-12411.653084089068},null,null,null,"TJ","Consumo efetivo de Gás Natural na aplicação final utilizando H2"]
[]
[]
[null,null,"Mitigação de emissões (fluxos físicios relacionados a Receitas)",null,null,null,null,null,null,null,null,null,null,null,null,null,null,null,null,null,null,null,null,null,null,null,null,null,null,null,null,null,null,{"$f":"C28","v":"Mitigação de emissões (fluxos físicios relacionados a Receitas)"}]
[null,null,"Emissão de CO2eq evitada no processo utilizando H2",null,"ton",null,{"$f":"(-G20+G25)*fator_emissao_fonte_substituida","v":0},0,4876.6499130355287,4827.8834139051669,4779.60457976612,4731.8085339684494,4684.4904486287642,4637.6455441424796,4591.2690887010604,4545.3563978140473,4499.902833835903,4876.6499130355287,4827.8834139051669,4779.60457976612,4731.8085339684494,4684.4904486287642,4637.6455441424796,4591.2690887010604,4545.3563978140473,4499.902833835903,4876.6499130355287,null,{"$f":"SUM(G29:AA29)","v":89225.871420630559},null,null,null,{"$f":"E29","v":"ton"},{"$f":"C29","v":"Emissão de CO2eq evitada no processo utilizando H2"}]
[]
[]
[null,null,"Insumos utilizados (fluxos físicos relacionados a Custos)",null,null,null,null,null,null,null,null,null,null,null,null,null,null,null,null,null,null,null,null,null,null,null,null,null,null,null,null,null,null,{"$f":"C32","v":"Insumos utilizados (fluxos físicos relacionados a Custos)"}]
[null,null,"Consumo de energia elétrica para a eletrólise",null,"MWh",null,{"$f":"IF(G5>=posterga,Consumo_de_energia_eletrica__MWh_ano,0)","v":0},0,-37667.999999544481,-37667.999999544481,-37667.999999544481,-37667.999999544481,-37667.999999544481,-37667.999999544481,-37667.999999544481,-37667.999999544481,-37667.999999544481,-37667.999999544481,-37667.999999544481,-37667.999999544481,-37667.999999544481,-37667.999999544481,-37667.999999544481,-37667.999999544481,-37667.999999544481,-37667.999999544481,-37667.999999544481,null,{"$f":"SUM(G33:AA33)","v":-715691.99999134499},null,null,null,{"$f":"E33","v":"MWh"},{"$f":"C33","v":"Consumo de energia elétrica para a eletrólise"}]
[null,null,"Consumo de água para a eletrólise",null,"m3",null,{"$f":"IF(G5>=posterga,Cons_Agua,0)","v":0},0,-12264.000000525601,-12264.000000525601,-12264.000000525601,-12264.000000525601,-12264.000000525601,-12264.000000525601,-12264.000000525601,-12264.000000525601,-12264.000000525601,-12264.000000525601,-12264.000000525601,-12264.000000525601,-12264.000000525601,-12264.000000525601,-12264.000000525601,-12264.000000525601,-12264.000000525601,-12264.000000525601,-12264.000000525601,null,{"$f":"SUM(G34:AA34)","v":-233016.00000998651},null,null,null,{"$f":"E34","v":"m3"},{"$f":"C34","v":"Consumo de água para a eletrólise"}]
[]
[]
[]
[]
[null,null,"5.2 Fluxo de caixa do projeto de substituição",null,null,null,0,1,2,3,4,5,6,7,8,9,10,11,12,13,14,15,16,17,18,19,20,null,"Acumulado no tempo de vida",null,null,null,null,"Descrição do campo"]
[]
[null,null,{"$f":"\"Receitas (milhares de \"&Moeda&\" )\"","v":"Receitas (milhares de BRL )"},null,null,null,null,null,null,null,null,null,null,null,null,null,null,null,null,null,null,null,null,null,null,null,null,null,null,null,null,null,null,{"$f":"C41","v":"Receitas (milhares de BRL )"}]
[null,null,{"$f":"\"Consumo evitado de \"&'(4) Entrada de dados'!F14","v":"Consumo evitado de Gás Natural"},null,null,null,{"$f":"(G22)*custo_fonte_substituida/10^3","v":0},0,9428.6920972406788,9334.405176268272,9241.0611245055898,9148.6505132605325,9057.1640081279274,8966.5923680466494,8876.9264443661832,8788.1571799225203,8700.2756081232965,9428.6920972406788,9334.405176268272,9241.0611245055898,9148.6505132605325,9057.1640081279274,8966.5923680466494,8876.9264443661832,8788.1571799225203,8700.2756081232965,9428.6920972406788,null,{"$f":"SUM(G42:AB42)","v":172512.54113696399},null,null,null,null,"Consumo evitado de Gás Natural"]
[null,null,"Oxigênio",null,null,null,{"$f":"G15*preco_do_oxigenio_por_m3","v":0},0,0,0,0,0,0,0,0,0,0,0,0,0,0,0,0,0,0,0,0,null,{"$f":"SUM(G43:AB43)","v":0},null,null,null,null,"Oxigênio"]
[null,null,"Créditos de Carbono",null,null,null,{"$f":"preco_credito_carbono_eq*(G29)/1000","v":0},0,0,0,0,0,0,0,0,0,0,0,0,0,0,0,0,0,0,0,0,null,{"$f":"SUM(G44:AB44)","v":0},null,null,null,null,"Créditos de Carbono"]
[null,null,"Valor residual do eletrolisador",null,null,null,null,null,null,null,null,null,null,null,null,null,null,null,null,null,null,null,null,null,null,null,{"$f":"valor_residual_ultimo_ano_EL/1000","v":10757.037037037036},null,{"$f":"SUM(G45:AB45)","v":10757.037037037036},null,null,null,null,"Valor residual do eletrolisador"]
[]
[null,null,{"$f":"\"Receita anual total (milhares de \"&Moeda&\" )\"","v":"Receita anual total (milhares de BRL )"},null,null,null,{"$f":"SUM(G42:G46)","v":0},0,9428.6920972406788,9334.405176268272,9241.0611245055898,9148.6505132605325,9057.1640081279274,8966.5923680466494,8876.9264443661832,8788.1571799225203,8700.2756081232965,9428.6920972406788,9334.405176268272,9241.0611245055898,9148.6505132605325,9057.1640081279274,8966.5923680466494,8876.9264443661832,8788.1571799225203,8700.2756081232965,20185.729134277717,null,{"$f":"SUM(AC42:AC46)","v":183269.57817400101},null,null,null,null,{"$f":"C47","v":"Receita anual total (milhares de BRL )"}]
[]
[null,null,{"$f":"\"Custos (milhares de \"&Moeda&\" )\"","v":"Custos (milhares de BRL )"},null,null,null,null,null,null,null,null,null,null,null,null,null,null,null,null,null,null,null,null,null,null,null,null,null,null,null,null,null,null,{"$f":"C49","v":"Custos (milhares de BRL )"}]
[null,null,"Energia elétrica adquirida para uso no EL",null,null,null,{"$f":"(G33)*custo_da_energia_eletrica_por_MWh/1000","v":0},0,-5650.1999999316722,-5650.1999999316722,-5650.1999999316722,-5650.1999999316722,-5650.1999999316722,-5650.1999999316722,-5650.1999999316722,-5650.1999999316722,-5650.1999999316722,-5650.1999999316722,-5650.1999999316722,-5650.1999999316722,-5650.1999999316722,-5650.1999999316722,-5650.1999999316722,-5650.1999999316722,-5650.1999999316722,-5650.1999999316722,-5650.1999999316722,null,{"$f":"SUM(G50:AB50)","v":-107353.79999870181},null,null,null,null,{"$f":"C50","v":"Energia elétrica adquirida para uso no EL"}]
[null,null,"Água EL",null,null,null,{"$f":"G34*custo_da_agua_por_m3/1000","v":0},0,-7.3584000003153607,-7.3584000003153607,-7.3584000003153607,-7.3584000003153607,-7.3584000003153607,-7.3584000003153607,-7.3584000003153607,-7.3584000003153607,-7.3584000003153607,-7.3584000003153607,-7.3584000003153607,-7.3584000003153607,-7.3584000003153607,-7.3584000003153607,-7.3584000003153607,-7.3584000003153607,-7.3584000003153607,-7.3584000003153607,-7.3584000003153607,null,{"$f":"SUM(G51:AB51)","v":-139.80960000599183},null,null,null,null,{"$f":"C51","v":"Água EL"}]
[null,null,"Operação e Manutenção EL",null,null,null,{"$f":"IF(G5>=posterga,custos_OeM_EL/1000,0)","v":0},0,-907.625,-907.625,-907.625,-907.625,-907.625,-907.625,-907.625,-907.625,-907.625,-907.625,-907.625,-907.625,-907.625,-907.625,-907.625,-907.625,-907.625,-907.625,-907.625,null,{"$f":"SUM(G52:AB52)","v":-17244.875},null,null,null,null,"Operação e Manutenção EL"]
[null,null,"Troca de Membrana EL",null,null,null,0,0,{"$f":"IF(I10,custo_troca_membrana/1000,0)","v":0},0,0,0,0,0,0,0,-7261,0,0,0,0,0,0,0,0,-7261,0,null,{"$f":"SUM(G53:AB53)","v":-14522},null,null,null,null,"Troca de Membrana EL"]
[null,null,"Outros custos EL",null,null,null,{"$f":"IF(G5>=posterga,custos_outros_opex_EL/1000,0)","v":0},0,-907.625,-907.625,-907.625,-907.625,-907.625,-907.625,-907.625,-907.625,-907.625,-907.625,-907.625,-907.625,-907.625,-907.625,-907.625,-907.625,-907.625,-907.625,-907.625,null,{"$f":"SUM(G54:AB54)","v":-17244.875},null,null,null,null,"Outros custos EL"]
[null,null,"Demais custos (TBD - to be defined)",null,null,null,null,null,null,null,null,null,null,null,null,null,null,null,null,null,null,null,null,null,null,null,null,null,null,null,null,null,null,"Demais custos (TBD - to be defined)"]
[]
[null,null,{"$f":"\"Custo anual total (milhares de \"&Moeda&\" )\"","v":"Custo anual total (milhares de BRL )"},null,null,null,{"$f":"SUM(G50:G56)","v":0},{"$f":"SUM(H50:H56)","v":0},-7472.8083999319879,-7472.8083999319879,-7472.8083999319879,-7472.8083999319879,-7472.8083999319879,-7472.8083999319879,-7472.8083999319879,-7472.8083999319879,-14733.808399931988,-7472.8083999319879,-7472.8083999319879,-7472.8083999319879,-7472.8083999319879,-7472.8083999319879,-7472.8083999319879,-7472.8083999319879,-7472.8083999319879,-14733.808399931988,-7472.8083999319879,null,{"$f":"SUM(AC50:AC56)","v":-156505.35959870782},null,null,null,null,{"$f":"C57","v":"Custo anual total (milhares de BRL )"}]
[]
[null,null,{"$f":"\"Investimento (milhares de \"&Moeda&\" )\"","v":"Investimento (milhares de BRL )"},null,null,null,null,null,null,null,null,null,null,null,null,null,null,null,null,null,null,null,null,null,null,null,null,null,null,null,null,null,null,{"$f":"\"Investimento (milhares de \"&Moeda&\" )\"","v":"Investimento (milhares de BRL )"}]
[null,null,"Alocação do Investimento",null,"%",null,0.8,0.2,0,0,0,null,null,null,null,null,null,null,null,null,null,null,null,null,null,null,null,null,{"$f":"SUM(G60:AB60)","v":1},null,null,null,null,{"$f":"C60","v":"Alocação do Investimento"}]
[null,null,"CAPEX relacionado ao eletrolisador",null,null,true,{"$f":"IF($F$61,CAPEX_EL/10^3*G60,0)","v":-43566},{"$f":"IF($F$61,CAPEX_EL/10^3*H60,0)","v":-10891.5},{"$f":"IF($F$61,CAPEX_EL/10^3*I60,0)","v":0},{"$f":"IF($F$61,CAPEX_EL/10^3*J60,0)","v":0},{"$f":"IF($F$61,CAPEX_EL/10^3*K60,0)","v":0},null,null,null,null,null,null,null,null,null,null,null,null,null,null,null,null,null,{"$f":"SUM(G61:AB61)","v":-54457.5},null,null,null,null,{"$f":"C61","v":"CAPEX relacionado ao eletrolisador"}]
[]
[]
[null,null,{"$f":"\"Investimento total (milhares de \"&Moeda&\" )\"","v":"Investimento total (milhares de BRL )"},null,{"$f":"Moeda","v":"BRL"},null,{"$f":"SUM(G61)","v":-43566},{"$f":"SUM(H61)","v":-10891.5},{"$f":"SUM(I61)","v":0},{"$f":"SUM(J61)","v":0},{"$f":"SUM(K61)","v":0},null,null,null,null,null,null,null,null,null,null,null,null,null,null,null,null,null,{"$f":"SUM(G64:AB64)","v":-54457.5},null,null,null,null,{"$f":"C64","v":"Investimento total (milhares de BRL )"}]
[]
[null,null,{"$f":"\"Fluxo de Caixa (milhares de \"&Moeda&\" )\"","v":"Fluxo de Caixa (milhares de BRL )"},null,null,null,null,null,null,null,null,null,null,null,null,null,null,null,null,null,null,null,null,null,null,null,null,null,null,null,null,null,null,{"$f":"\"Fluxo de Caixa (milhares de \"&Moeda&\" )\"","v":"Fluxo de Caixa (milhares de BRL )"}]
[null,null,"Fluxos de Caixa",null,null,null,{"$f":"G47+G57+G64","v":-43566},-10891.5,1955.8836973086909,1861.5967763362842,1768.2527245736019,1675.8421133285447,1584.3556081959396,1493.7839681146615,1404.1180444341953,1315.3487799905324,-6033.5327918086914,1955.8836973086909,1861.5967763362842,1768.2527245736019,1675.8421133285447,1584.3556081959396,1493.7839681146615,1404.1180444341953,1315.3487799905324,-6033.5327918086914,12712.920734345729,null,{"$f":"AC47+AC57+AC61","v":-27693.281424706802},null,null,null,null,{"$f":"C67","v":"Fluxos de Caixa"}]
[null,null,"Fluxo de Caixa Acumulado",null,null,null,{"$f":"+G67","v":-43566},{"$f":"+G68+H67","v":-54457.5},{"$f":"+H68+I67","v":-52501.616302691313},{"$f":"+I68+J67","v":-50640.019526355027},{"$f":"+J68+K67","v":-48871.766801781429},-47195.924688452884,-45611.569080256944,{"$f":"+M68+N67","v":-44117.785112142286},-42713.667067708091,-41398.318287717557,-47431.851079526248,-45475.967382217554,-43614.370605881268,-41846.117881307669,-40170.275767979125,-38585.920159783185,-37092.136191668527,-35688.018147234332,-34372.669367243798,-40406.202159052489,-27693.281424706758,null,null,null,null,{"$f":"AC67-AC68","v":-27693.281424706802},null,{"$f":"C68","v":"Fluxo de Caixa Acumulado"}]

{"sheet":"(6) Resultados","index":5,"n_rows":106,"n_cols":32,"rows_kept":106,"cut":false,"hidden":false,"merged":[[8,8,20,10],[8,4,20,6],[26,4,38,6],[44,4,56,6],[44,8,56,10],[30,8,30,10],[31,8,32,10],[36,8,36,10],[37,8,39,10]]}
[]
[null,"6. Resultados",null,null,null,null,null,null,null,null,null,null,null,null,null,null,null,null,null,null,null,null,null,null,null,null,null,null,null,null,null,{"$f":"SUM(AF3:AF1048576)","v":{"$error":"#REF!"}}]
[]
[]
[null,null,"Relatório",null,"CAPEX eletrolisador",null,null,null,null,null,null,null,"Project Cash Flows",null,{"$f":"C87","v":"Fluxos de Caixa"},null,{"$f":"C106","v":"Fluxo de Caixa Acumulado"}]
[]
[null,null,null,null,"Valor Presente Líquido (milhares BRL)",null,null,null,"Período de Payback Simples"]
[null,null,null,null,"VPL do projeto de substituição",null,null,null,"Payback do projeto de substituição"]
[null,null,null,null,{"$f":"G89","v":-38477.218064217079},null,null,null,{"$f":"AC102","v":20}]
[]
[]
[]
[]
[]
[null,null,null,null,null,null,null,null,null,null,null,null,null,null,null,null,null,null,null,null,null,null,null,null,null,null,null,null,null,null,null,{"$f":"#REF!-AC87","v":{"$error":"#REF!"}}]
[]
[]
[]
[]
[]
[]
[]
[]
[]
[null,null,null,null,"Taxa Interna de Retorno (% a.a.)",null,null,null,"Composição de valores no LCOH (BRL/kg)"]
[null,null,null,null,"TIR do projeto de substituição",null,null,null,"Custo nivelado do H2 produzido"]
[null,null,null,null,{"$f":"G90","v":-5.1453324568138781E-2},null,null,null,"Investimento eletrolisador",null,{"$f":"-NPV(TxDesconto,G83:AA83)/NPV(TxDesconto,'(5) Simulação e Fluxo de Caixa'!G14:AA14)","v":6.7018201318304662}]
[null,null,null,null,null,null,null,null,"O&M e membrana",null,{"$f":"-(NPV(TxDesconto,'(5) Simulação e Fluxo de Caixa'!G52:AA52)+NPV(TxDesconto,'(5) Simulação e Fluxo de Caixa'!G53:AA53)+NPV(TxDesconto,'(5) Simulação e Fluxo de Caixa'!G54:AA54))/NPV(TxDesconto,'(5) Simulação e Fluxo de Caixa'!G14:AA14)","v":3.506821712959594}]
[null,null,null,null,null,null,null,null,"Água",null,{"$f":"-NPV(TxDesconto,'(5) Simulação e Fluxo de Caixa'!G51:AA51)/NPV(TxDesconto,'(5) Simulação e Fluxo de Caixa'!G14:AA14)","v":1.0523090508809832E-2}]
[null,null,null,null,null,null,null,null,"Eletricidade",null,{"$f":"-NPV(TxDesconto,'(5) Simulação e Fluxo de Caixa'!G50:AA50)/NPV(TxDesconto,'(5) Simulação e Fluxo de Caixa'!G14:AA14)","v":8.080230211677824}]
[null,null,null,null,null,null,null,null,"LCOH (BRL/kg)"]
[null,null,null,null,null,null,null,null,{"$f":"SUM(K27:K30)","v":18.299395146976693}]
[]
[null,null,null,null,null,null,null,null,"Receita de O2",null,{"$f":"NPV(TxDesconto,G96:AA96)/NPV(TxDesconto,'(5) Simulação e Fluxo de Caixa'!G14:AA14)","v":0}]
[null,null,null,null,null,null,null,null,"Receita de CO2",null,{"$f":"NPV(TxDesconto,G95:AA95)/NPV(TxDesconto,'(5) Simulação e Fluxo de Caixa'!G14:AA14)","v":0}]
[null,null,null,null,null,null,null,null,"Receita de valor residual",null,{"$f":"NPV(TxDesconto,G97:AA97)/NPV(TxDesconto,'(5) Simulação e Fluxo de Caixa'!G14:AA14)","v":0.50372987654000367}]
[null,null,null,null,null,null,null,null,"LCOH final(BRL/kg)"]
[null,null,null,null,null,null,null,null,{"$f":"I32-K34-K35-K36","v":17.79566527043669}]
[]
[null,null,null,null,{"$f":"IFERROR(IF(E27>0,\"\",\"Projeto inviável em qualquer cenário\"),\"Erro no cálculo da TIR - Projeto inviável\")","v":"Projeto inviável em qualquer cenário"}]
[]
[]
[null,null,null,null,"Emissões Evitadas (tonCO2eq/ano)",null,null,null,{"$f":"\"Custo de competitividade da fonte fóssil (\"&Moeda&\"/\"&Unidade_fonte_substituida&\")\"","v":"Custo de competitividade da fonte fóssil (BRL/m3)"}]
[null,null,null,null,"Média anual das emissões evitadas",null,null,null,"Preço da fonte fóssil, abaixo do qual o H2 é promissor"]
[null,null,null,null,{"$f":"IFERROR(AVERAGEIF('(5) Simulação e Fluxo de Caixa'!F29:AA29,\">0\",'(5) Simulação e Fluxo de Caixa'!F29:AA29),0)+IFERROR(AVERAGEIF('(5) Simulação e Fluxo de Caixa'!#REF!,\">0\",'(5) Simulação e Fluxo de Caixa'!#REF!),0)","v":4696.0984958226609},null,null,null,{"$f":"G100","v":5.4693080073200369}]
[]
[]
[]
[]
[]
[]
[]
[]
[]
[]
[]
[]
[]
[]
[]
[]
[null,null,"Fluxo de caixa previsto",null,null,null,0,1,2,3,4,5,6,7,8,9,10,11,12,13,14,15,16,17,18,19,20,null,"Lifetime"]
[]
[null,null,"Receitas"]
[null,null,"Energia Evitada",null,null,null,null,null,null,null,null,null,null,null,null,null,null,null,null,null,null,null,null,null,null,null,null,null,{"$f":"SUM(G65:AB65)","v":0}]
[null,null,"Hidrogênio"]
[null,null,"Outros",null,null,null,null,null,null,null,null,null,null,null,null,null,null,null,null,null,null,null,null,null,null,null,null,null,{"$f":"SUM(G67:AB67)","v":0}]
[]
[null,null,{"$f":"C64","v":"Receitas"},null,{"$f":"Moeda","v":"BRL"},null,null,{"$f":"'(5) Simulação e Fluxo de Caixa'!H47","v":0},{"$f":"'(5) Simulação e Fluxo de Caixa'!I47","v":9428.6920972406788},{"$f":"'(5) Simulação e Fluxo de Caixa'!J47","v":9334.405176268272},{"$f":"'(5) Simulação e Fluxo de Caixa'!K47","v":9241.0611245055898},{"$f":"'(5) Simulação e Fluxo de Caixa'!L47","v":9148.6505132605325},{"$f":"'(5) Simulação e Fluxo de Caixa'!M47","v":9057.1640081279274},{"$f":"'(5) Simulação e Fluxo de Caixa'!N47","v":8966.5923680466494},{"$f":"'(5) Simulação e Fluxo de Caixa'!O47","v":8876.9264443661832},{"$f":"'(5) Simulação e Fluxo de Caixa'!P47","v":8788.1571799225203},{"$f":"'(5) Simulação e Fluxo de Caixa'!Q47","v":8700.2756081232965},{"$f":"'(5) Simulação e Fluxo de Caixa'!R47","v":9428.6920972406788},{"$f":"'(5) Simulação e Fluxo de Caixa'!S47","v":9334.405176268272},{"$f":"'(5) Simulação e Fluxo de Caixa'!T47","v":9241.0611245055898},{"$f":"'(5) Simulação e Fluxo de Caixa'!U47","v":9148.6505132605325},{"$f":"'(5) Simulação e Fluxo de Caixa'!V47","v":9057.1640081279274},{"$f":"'(5) Simulação e Fluxo de Caixa'!W47","v":8966.5923680466494},{"$f":"'(5) Simulação e Fluxo de Caixa'!X47","v":8876.9264443661832},{"$f":"'(5) Simulação e Fluxo de Caixa'!Y47","v":8788.1571799225203},{"$f":"'(5) Simulação e Fluxo de Caixa'!Z47","v":8700.2756081232965},{"$f":"'(5) Simulação e Fluxo de Caixa'!AA47","v":20185.729134277717},null,{"$f":"SUM(AC65:AC68)","v":0}]
[]
[null,null,{"$f":"'(5) Simulação e Fluxo de Caixa'!C49","v":"Custos (milhares de BRL )"}]
[null,null,"Eletrolisador",null,{"$f":"Moeda","v":"BRL"},null,{"$f":"SUM('(5) Simulação e Fluxo de Caixa'!G50:G54)","v":0},{"$f":"SUM('(5) Simulação e Fluxo de Caixa'!H50:H54)","v":0},{"$f":"SUM('(5) Simulação e Fluxo de Caixa'!I50:I54)","v":-7472.8083999319879},{"$f":"SUM('(5) Simulação e Fluxo de Caixa'!J50:J54)","v":-7472.8083999319879},{"$f":"SUM('(5) Simulação e Fluxo de Caixa'!K50:K54)","v":-7472.8083999319879},{"$f":"SUM('(5) Simulação e Fluxo de Caixa'!L50:L54)","v":-7472.8083999319879},{"$f":"SUM('(5) Simulação e Fluxo de Caixa'!M50:M54)","v":-7472.8083999319879},{"$f":"SUM('(5) Simulação e Fluxo de Caixa'!N50:N54)","v":-7472.8083999319879},{"$f":"SUM('(5) Simulação e Fluxo de Caixa'!O50:O54)","v":-7472.8083999319879},{"$f":"SUM('(5) Simulação e Fluxo de Caixa'!P50:P54)","v":-7472.8083999319879},{"$f":"SUM('(5) Simulação e Fluxo de Caixa'!Q50:Q54)","v":-14733.808399931988},{"$f":"SUM('(5) Simulação e Fluxo de Caixa'!R50:R54)","v":-7472.8083999319879},{"$f":"SUM('(5) Simulação e Fluxo de Caixa'!S50:S54)","v":-7472.8083999319879},{"$f":"SUM('(5) Simulação e Fluxo de Caixa'!T50:T54)","v":-7472.8083999319879},{"$f":"SUM('(5) Simulação e Fluxo de Caixa'!U50:U54)","v":-7472.8083999319879},{"$f":"SUM('(5) Simulação e Fluxo de Caixa'!V50:V54)","v":-7472.8083999319879},{"$f":"SUM('(5) Simulação e Fluxo de Caixa'!W50:W54)","v":-7472.8083999319879},{"$f":"SUM('(5) Simulação e Fluxo de Caixa'!X50:X54)","v":-7472.8083999319879},{"$f":"SUM('(5) Simulação e Fluxo de Caixa'!Y50:Y54)","v":-7472.8083999319879},{"$f":"SUM('(5) Simulação e Fluxo de Caixa'!Z50:Z54)","v":-14733.808399931988},{"$f":"SUM('(5) Simulação e Fluxo de Caixa'!AA50:AA54)","v":-7472.8083999319879},null,{"$f":"SUM(G72:AB72)","v":-156505.35959870782}]
[null,null,"TBD",null,{"$f":"Moeda","v":"BRL"},null,null,null,null,null,null,null,null,null,null,null,null,null,null,null,null,null,null,null,null,null,null,null,{"$f":"SUM(G73:AB73)","v":0}]
[null,null,"TBD",null,{"$f":"Moeda","v":"BRL"},null,null,null,null,null,null,null,null,null,null,null,null,null,null,null,null,null,null,null,null,null,null,null,{"$f":"SUM(G74:AB74)","v":0}]
[]
[null,null,{"$f":"C71","v":"Custos (milhares de BRL )"},null,{"$f":"Moeda","v":"BRL"},null,{"$f":"SUM(G72:G74)","v":0},0,-7472.8083999319879,-7472.8083999319879,-7472.8083999319879,-7472.8083999319879,-7472.8083999319879,-7472.8083999319879,-7472.8083999319879,-7472.8083999319879,-14733.808399931988,-7472.8083999319879,-7472.8083999319879,-7472.8083999319879,-7472.8083999319879,-7472.8083999319879,-7472.8083999319879,-7472.8083999319879,-7472.8083999319879,-14733.808399931988,-7472.8083999319879,null,{"$f":"-SUM(AC72:AC75)","v":156505.35959870782}]
[null,null,null,null,null,null,{"$f":"G76/(1+TxDesconto)^COUNT($G$76:G76)","v":0},{"$f":"H76/(1+TxDesconto)^COUNT($G$76:H76)","v":0},{"$f":"I76/(1+TxDesconto)^COUNT($G$76:I76)","v":-6455.2928624830902},{"$f":"J76/(1+TxDesconto)^COUNT($G$76:J76)","v":-6147.8979642696104},{"$f":"K76/(1+TxDesconto)^COUNT($G$76:K76)","v":-5855.1409183520091},{"$f":"L76/(1+TxDesconto)^COUNT($G$76:L76)","v":-5576.3246841447717},{"$f":"M76/(1+TxDesconto)^COUNT($G$76:M76)","v":-5310.7854134712097},{"$f":"N76/(1+TxDesconto)^COUNT($G$76:N76)","v":-5057.8908699725816},{"$f":"O76/(1+TxDesconto)^COUNT($G$76:O76)","v":-4817.0389237834106},{"$f":"P76/(1+TxDesconto)^COUNT($G$76:P76)","v":-4587.6561178889624},{"$f":"Q76/(1+TxDesconto)^COUNT($G$76:Q76)","v":-8614.5526208080137},{"$f":"R76/(1+TxDesconto)^COUNT($G$76:R76)","v":-4161.1393359537078},{"$f":"S76/(1+TxDesconto)^COUNT($G$76:S76)","v":-3962.9898437654351},{"$f":"T76/(1+TxDesconto)^COUNT($G$76:T76)","v":-3774.2760416813676},{"$f":"U76/(1+TxDesconto)^COUNT($G$76:U76)","v":-3594.5486111251112},{"$f":"V76/(1+TxDesconto)^COUNT($G$76:V76)","v":-3423.3796296429632},{"$f":"W76/(1+TxDesconto)^COUNT($G$76:W76)","v":-3260.3615520409166},{"$f":"X76/(1+TxDesconto)^COUNT($G$76:X76)","v":-3105.1062400389683},{"$f":"Y76/(1+TxDesconto)^COUNT($G$76:Y76)","v":-2957.2440381323509},{"$f":"Z76/(1+TxDesconto)^COUNT($G$76:Z76)","v":-5553.0174286002393},{"$f":"AA76/(1+TxDesconto)^COUNT($G$76:AA76)","v":-2682.3075175803638}]
[null,null,"Investimento"]
[null,null,"Alocação de Investimentos",null,"%",null,{"$f":"'(5) Simulação e Fluxo de Caixa'!G60","v":0.8},{"$f":"'(5) Simulação e Fluxo de Caixa'!H60","v":0.2},{"$f":"'(5) Simulação e Fluxo de Caixa'!I60","v":0},{"$f":"'(5) Simulação e Fluxo de Caixa'!J60","v":0},{"$f":"'(5) Simulação e Fluxo de Caixa'!K60","v":0},{"$f":"'(5) Simulação e Fluxo de Caixa'!L60","v":0},null,null,null,null,null,null,null,null,null,null,null,null,null,null,null,null,{"$f":"SUM(G79:AB79)","v":1},null,null,{"$f":"(1-AC79)*1000","v":0}]
[]
[]
[]
[null,null,{"$f":"C78","v":"Investimento"},null,{"$f":"Moeda","v":"BRL"},null,{"$f":"'(5) Simulação e Fluxo de Caixa'!G64","v":-43566},{"$f":"'(5) Simulação e Fluxo de Caixa'!H64","v":-10891.5},{"$f":"'(5) Simulação e Fluxo de Caixa'!I64","v":0},{"$f":"'(5) Simulação e Fluxo de Caixa'!J64","v":0},{"$f":"'(5) Simulação e Fluxo de Caixa'!K64","v":0},{"$f":"'(5) Simulação e Fluxo de Caixa'!L64","v":0},null,null,null,null,null,null,null,null,null,null,null,null,null,null,null,null,{"$f":"SUM(G83:AB83)","v":-54457.5}]
[]
[]
[null,null,"Fluxos de Caixa"]
[null,null,"Fluxos de Caixa",null,{"$f":"Moeda","v":"BRL"},null,{"$f":"G69+G76+G83","v":-43566},-10891.5,1955.8836973086909,1861.5967763362842,1768.2527245736019,1675.8421133285447,1584.3556081959396,1493.7839681146615,1404.1180444341953,1315.3487799905324,-6033.5327918086914,1955.8836973086909,1861.5967763362842,1768.2527245736019,1675.8421133285447,1584.3556081959396,1493.7839681146615,1404.1180444341953,1315.3487799905324,-6033.5327918086914,12712.920734345729,null,{"$f":"AC69+AC76+AC83","v":102047.85959870782}]
[null,null,"Fluxo de Caixa Acumulado",null,{"$f":"Moeda","v":"BRL"},null,{"$f":"+G87","v":-43566},{"$f":"+G88+H87","v":-54457.5},-52501.616302691313,-50640.019526355027,-48871.766801781429,-47195.924688452884,-45611.569080256944,-44117.785112142286,-42713.667067708091,-41398.318287717557,-47431.851079526248,-45475.967382217554,-43614.370605881268,-41846.117881307669,-40170.275767979125,-38585.920159783185,-37092.136191668527,-35688.018147234332,-34372.669367243798,-40406.202159052489,-27693.281424706758,null,{"$f":"AA88","v":-27693.281424706758},null,null,{"$f":"AC87-AC88","v":129741.14102341457}]
[null,null,"Valor presente dos fluxos de caixa",null,{"$f":"Moeda","v":"BRL"},null,{"$f":"NPV(TxDesconto,H87:AA87)+G87","v":-38477.218064217079}]
[null,null,"TIR (taxa interna de retorno)",null,"%",null,{"$f":"IRR(G87:AA87)","v":-5.1453324568138781E-2}]
[null,null,"TIRM (TIR modificada)",null,"%",null,{"$f":"MIRR(G87:AA87,TxDesconto,TxDesconto)","v":-2.4229852446282507E-3}]
[]
[null,null,"Cálculo do LCOH"]
[null,null,"Custos associados ao H2",null,{"$f":"Moeda","v":"BRL"},null,{"$f":"'(5) Simulação e Fluxo de Caixa'!G57+'(5) Simulação e Fluxo de Caixa'!G64","v":-43566},{"$f":"'(5) Simulação e Fluxo de Caixa'!H57+'(5) Simulação e Fluxo de Caixa'!H64","v":-10891.5},{"$f":"'(5) Simulação e Fluxo de Caixa'!I57+'(5) Simulação e Fluxo de Caixa'!I64","v":-7472.8083999319879},{"$f":"'(5) Simulação e Fluxo de Caixa'!J57+'(5) Simulação e Fluxo de Caixa'!J64","v":-7472.8083999319879},{"$f":"'(5) Simulação e Fluxo de Caixa'!K57+'(5) Simulação e Fluxo de Caixa'!K64","v":-7472.8083999319879},{"$f":"'(5) Simulação e Fluxo de Caixa'!L57+'(5) Simulação e Fluxo de Caixa'!L64","v":-7472.8083999319879},{"$f":"'(5) Simulação e Fluxo de Caixa'!M57+'(5) Simulação e Fluxo de Caixa'!M64","v":-7472.8083999319879},{"$f":"'(5) Simulação e Fluxo de Caixa'!N57+'(5) Simulação e Fluxo de Caixa'!N64","v":-7472.8083999319879},{"$f":"'(5) Simulação e Fluxo de Caixa'!O57+'(5) Simulação e Fluxo de Caixa'!O64","v":-7472.8083999319879},{"$f":"'(5) Simulação e Fluxo de Caixa'!P57+'(5) Simulação e Fluxo de Caixa'!P64","v":-7472.8083999319879},{"$f":"'(5) Simulação e Fluxo de Caixa'!Q57+'(5) Simulação e Fluxo de Caixa'!Q64","v":-14733.808399931988},{"$f":"'(5) Simulação e Fluxo de Caixa'!R57+'(5) Simulação e Fluxo de Caixa'!R64","v":-7472.8083999319879},{"$f":"'(5) Simulação e Fluxo de Caixa'!S57+'(5) Simulação e Fluxo de Caixa'!S64","v":-7472.8083999319879},{"$f":"'(5) Simulação e Fluxo de Caixa'!T57+'(5) Simulação e Fluxo de Caixa'!T64","v":-7472.8083999319879},{"$f":"'(5) Simulação e Fluxo de Caixa'!U57+'(5) Simulação e Fluxo de Caixa'!U64","v":-7472.8083999319879},{"$f":"'(5) Simulação e Fluxo de Caixa'!V57+'(5) Simulação e Fluxo de Caixa'!V64","v":-7472.8083999319879},{"$f":"'(5) Simulação e Fluxo de Caixa'!W57+'(5) Simulação e Fluxo de Caixa'!W64","v":-7472.8083999319879},{"$f":"'(5) Simulação e Fluxo de Caixa'!X57+'(5) Simulação e Fluxo de Caixa'!X64","v":-7472.8083999319879},{"$f":"'(5) Simulação e Fluxo de Caixa'!Y57+'(5) Simulação e Fluxo de Caixa'!Y64","v":-7472.8083999319879},{"$f":"'(5) Simulação e Fluxo de Caixa'!Z57+'(5) Simulação e Fluxo de Caixa'!Z64","v":-14733.808399931988},{"$f":"'(5) Simulação e Fluxo de Caixa'!AA57+'(5) Simulação e Fluxo de Caixa'!AA64","v":-7472.8083999319879}]
[null,null,"Receita do crédito de CO2",null,{"$f":"Moeda","v":"BRL"},null,{"$f":"'(5) Simulação e Fluxo de Caixa'!G44","v":0},{"$f":"'(5) Simulação e Fluxo de Caixa'!H44","v":0},{"$f":"'(5) Simulação e Fluxo de Caixa'!I44","v":0},{"$f":"'(5) Simulação e Fluxo de Caixa'!J44","v":0},{"$f":"'(5) Simulação e Fluxo de Caixa'!K44","v":0},{"$f":"'(5) Simulação e Fluxo de Caixa'!L44","v":0},{"$f":"'(5) Simulação e Fluxo de Caixa'!M44","v":0},{"$f":"'(5) Simulação e Fluxo de Caixa'!N44","v":0},{"$f":"'(5) Simulação e Fluxo de Caixa'!O44","v":0},{"$f":"'(5) Simulação e Fluxo de Caixa'!P44","v":0},{"$f":"'(5) Simulação e Fluxo de Caixa'!Q44","v":0},{"$f":"'(5) Simulação e Fluxo de Caixa'!R44","v":0},{"$f":"'(5) Simulação e Fluxo de Caixa'!S44","v":0},{"$f":"'(5) Simulação e Fluxo de Caixa'!T44","v":0},{"$f":"'(5) Simulação e Fluxo de Caixa'!U44","v":0},{"$f":"'(5) Simulação e Fluxo de Caixa'!V44","v":0},{"$f":"'(5) Simulação e Fluxo de Caixa'!W44","v":0},{"$f":"'(5) Simulação e Fluxo de Caixa'!X44","v":0},{"$f":"'(5) Simulação e Fluxo de Caixa'!Y44","v":0},{"$f":"'(5) Simulação e Fluxo de Caixa'!Z44","v":0},{"$f":"'(5) Simulação e Fluxo de Caixa'!AA44","v":0}]
[null,null,"Receita do aproveitamento do O2",null,"BRL",null,{"$f":"'(5) Simulação e Fluxo de Caixa'!G43","v":0},{"$f":"'(5) Simulação e Fluxo de Caixa'!H43","v":0},{"$f":"'(5) Simulação e Fluxo de Caixa'!I43","v":0},{"$f":"'(5) Simulação e Fluxo de Caixa'!J43","v":0},{"$f":"'(5) Simulação e Fluxo de Caixa'!K43","v":0},{"$f":"'(5) Simulação e Fluxo de Caixa'!L43","v":0},{"$f":"'(5) Simulação e Fluxo de Caixa'!M43","v":0},{"$f":"'(5) Simulação e Fluxo de Caixa'!N43","v":0},{"$f":"'(5) Simulação e Fluxo de Caixa'!O43","v":0},{"$f":"'(5) Simulação e Fluxo de Caixa'!P43","v":0},{"$f":"'(5) Simulação e Fluxo de Caixa'!Q43","v":0},{"$f":"'(5) Simulação e Fluxo de Caixa'!R43","v":0},{"$f":"'(5) Simulação e Fluxo de Caixa'!S43","v":0},{"$f":"'(5) Simulação e Fluxo de Caixa'!T43","v":0},{"$f":"'(5) Simulação e Fluxo de Caixa'!U43","v":0},{"$f":"'(5) Simulação e Fluxo de Caixa'!V43","v":0},{"$f":"'(5) Simulação e Fluxo de Caixa'!W43","v":0},{"$f":"'(5) Simulação e Fluxo de Caixa'!X43","v":0},{"$f":"'(5) Simulação e Fluxo de Caixa'!Y43","v":0},{"$f":"'(5) Simulação e Fluxo de Caixa'!Z43","v":0},{"$f":"'(5) Simulação e Fluxo de Caixa'!AA43","v":0}]
[null,null,"Receita de valores residuais",null,"BRL",null,{"$f":"'(5) Simulação e Fluxo de Caixa'!G45","v":0},{"$f":"'(5) Simulação e Fluxo de Caixa'!H45","v":0},{"$f":"'(5) Simulação e Fluxo de Caixa'!I45","v":0},{"$f":"'(5) Simulação e Fluxo de Caixa'!J45","v":0},{"$f":"'(5) Simulação e Fluxo de Caixa'!K45","v":0},{"$f":"'(5) Simulação e Fluxo de Caixa'!L45","v":0},{"$f":"'(5) Simulação e Fluxo de Caixa'!M45","v":0},{"$f":"'(5) Simulação e Fluxo de Caixa'!N45","v":0},{"$f":"'(5) Simulação e Fluxo de Caixa'!O45","v":0},{"$f":"'(5) Simulação e Fluxo de Caixa'!P45","v":0},{"$f":"'(5) Simulação e Fluxo de Caixa'!Q45","v":0},{"$f":"'(5) Simulação e Fluxo de Caixa'!R45","v":0},{"$f":"'(5) Simulação e Fluxo de Caixa'!S45","v":0},{"$f":"'(5) Simulação e Fluxo de Caixa'!T45","v":0},{"$f":"'(5) Simulação e Fluxo de Caixa'!U45","v":0},{"$f":"'(5) Simulação e Fluxo de Caixa'!V45","v":0},{"$f":"'(5) Simulação e Fluxo de Caixa'!W45","v":0},{"$f":"'(5) Simulação e Fluxo de Caixa'!X45","v":0},{"$f":"'(5) Simulação e Fluxo de Caixa'!Y45","v":0},{"$f":"'(5) Simulação e Fluxo de Caixa'!Z45","v":0},{"$f":"'(5) Simulação e Fluxo de Caixa'!AA45","v":10757.037037037036}]
[null,null,"LCOH",null,"BRL/kg",null,{"$f":"-NPV(TxDesconto,G94:AA94)/NPV(TxDesconto,'(5) Simulação e Fluxo de Caixa'!G14:AA14)","v":18.299395146976696}]
[null,null,"LCOH considerando receitas",null,"BRL/kg",null,{"$f":"-(NPV(TxDesconto,G94:AA94)+NPV(TxDesconto,G95:AA95)+NPV(TxDesconto,G96:AA96)+NPV(TxDesconto,G97:AA97))/NPV(TxDesconto,'(5) Simulação e Fluxo de Caixa'!G14:AA14)","v":17.79566527043669}]
[null,null,"Preço break-even da fonte fóssil",null,{"$f":"Moeda&\"/\"&Unidade_fonte_substituida","v":"BRL/m3"},null,{"$f":"-(NPV(TxDesconto,G94:AA94)+NPV(TxDesconto,G95:AA95)+NPV(TxDesconto,G96:AA96)+NPV(TxDesconto,G97:AA97))/NPV(TxDesconto,'(5) Simulação e Fluxo de Caixa'!G22:AA22)*10^3","v":5.4693080073200369}]
[null,null,"Payback Period"]
[null,null,"Cálculo de payback",null,"Anos",null,null,{"$f":"IF(AND(H88>0,G88<0),-G88/H87+G102,IF(H88<0,G102+1,G102))","v":1},2,3,4,5,6,7,8,9,10,11,12,13,14,15,16,17,18,19,20,null,{"$f":"AA102","v":20}]
[]
[null,null,"Gráfico"]
[null,null,{"$f":"C87","v":"Fluxos de Caixa"},null,true,null,{"$f":"IF($E105,G87,\"\")","v":-43566},-10891.5,1955.8836973086909,1861.5967763362842,1768.2527245736019,1675.8421133285447,1584.3556081959396,1493.7839681146615,1404.1180444341953,1315.3487799905324,-6033.5327918086914,1955.8836973086909,1861.5967763362842,1768.2527245736019,1675.8421133285447,1584.3556081959396,1493.7839681146615,1404.1180444341953,1315.3487799905324,-6033.5327918086914,12712.920734345729]
[null,null,{"$f":"C88","v":"Fluxo de Caixa Acumulado"},null,true,null,{"$f":"IF($E106,G88,\"\")","v":-43566},-54457.5,-52501.616302691313,-50640.019526355027,-48871.766801781429,-47195.924688452884,-45611.569080256944,-44117.785112142286,-42713.667067708091,-41398.318287717557,-47431.851079526248,-45475.967382217554,-43614.370605881268,-41846.117881307669,-40170.275767979125,-38585.920159783185,-37092.136191668527,-35688.018147234332,-34372.669367243798,-40406.202159052489,-27693.281424706758]

{"sheet":"(7) Análise de sensibilidade","index":6,"n_rows":56,"n_cols":33,"rows_kept":56,"cut":false,"hidden":false,"merged":[]}
[]
[null,null,null,"7. Análise de Sensibilidade",null,null,null,null,null,null,null,null,null,null,null,null,null,null,null,null,null,null,null,null,null,null,null,null,null,null,null,null,{"$f":"SUM(AG3:AG1048576)","v":0}]
[]
[]
[null,null,null,"Análise de sensibilidade aplicadas sobre o VPL do projeto de substituição"]
[]
[]
[]
[]
[]
[]
[]
[null,null,null,"7.1 Variação do VPL mantendo-se os parâmetros constantes, exceto: o custo da energia elétrica e o custo da fonte fóssil"]
[]
[null,null,null,null,null,null,{"$f":"'(4) Entrada de dados'!E79","v":"VPL"},{"$f":"'(4) Entrada de dados'!F79","v":"Custo do Gás Natural"},{"$f":"'(4) Entrada de dados'!G79","v":"BRL/m3"}]
[null,null,null,null,null,null,{"$f":"'(4) Entrada de dados'!E80","v":-38477.218064217079},0,0.8,1.6,2.4000000000000004,3.2,4,4.8,5.6,6.3999999999999995,7.1999999999999993]
[null,null,null,null,null,{"$f":"'(4) Entrada de dados'!D81","v":"Custo da energia elétrica"},0,{"$f":"'(4) Entrada de dados'!F81","v":-78193.603141654254},{"$f":"'(4) Entrada de dados'!G81","v":-57243.758522268785},{"$f":"'(4) Entrada de dados'!H81","v":-36293.913902883331},{"$f":"'(4) Entrada de dados'!I81","v":-15344.069283497873},{"$f":"'(4) Entrada de dados'!J81","v":5605.7753358875925},{"$f":"'(4) Entrada de dados'!K81","v":26555.61995527304},{"$f":"'(4) Entrada de dados'!L81","v":47505.464574658501},{"$f":"'(4) Entrada de dados'!M81","v":68455.309194043919},{"$f":"'(4) Entrada de dados'!N81","v":89405.153813429381},{"$f":"'(4) Entrada de dados'!O81","v":110354.99843281481}]
[null,null,null,null,null,{"$f":"'(4) Entrada de dados'!D82","v":"BRL/MWh"},30,{"$f":"'(4) Entrada de dados'!F82","v":-91200.170745552285},{"$f":"'(4) Entrada de dados'!G82","v":-70250.326126166809},{"$f":"'(4) Entrada de dados'!H82","v":-49300.481506781362},{"$f":"'(4) Entrada de dados'!I82","v":-28350.636887395896},{"$f":"'(4) Entrada de dados'!J82","v":-7400.7922680104457},{"$f":"'(4) Entrada de dados'!K82","v":13549.052351374994},{"$f":"'(4) Entrada de dados'!L82","v":34498.896970760456},{"$f":"'(4) Entrada de dados'!M82","v":55448.741590145917},{"$f":"'(4) Entrada de dados'!N82","v":76398.586209531364},{"$f":"'(4) Entrada de dados'!O82","v":97348.430828916811}]
[null,null,null,null,null,null,60,{"$f":"'(4) Entrada de dados'!F83","v":-104206.73834945029},{"$f":"'(4) Entrada de dados'!G83","v":-83256.893730064825},{"$f":"'(4) Entrada de dados'!H83","v":-62307.049110679363},{"$f":"'(4) Entrada de dados'!I83","v":-41357.204491293909},{"$f":"'(4) Entrada de dados'!J83","v":-20407.359871908462},{"$f":"'(4) Entrada de dados'!K83","v":542.48474747698492},{"$f":"'(4) Entrada de dados'!L83","v":21492.329366862432},{"$f":"'(4) Entrada de dados'!M83","v":42442.173986247901},{"$f":"'(4) Entrada de dados'!N83","v":63392.018605633333},{"$f":"'(4) Entrada de dados'!O83","v":84341.863225018809}]
[null,null,null,null,null,null,90,{"$f":"'(4) Entrada de dados'!F84","v":-117213.3059533483},{"$f":"'(4) Entrada de dados'!G84","v":-96263.461333962856},{"$f":"'(4) Entrada de dados'!H84","v":-75313.616714577394},{"$f":"'(4) Entrada de dados'!I84","v":-54363.772095191925},{"$f":"'(4) Entrada de dados'!J84","v":-33413.927475806478},{"$f":"'(4) Entrada de dados'!K84","v":-12464.082856421035},{"$f":"'(4) Entrada de dados'!L84","v":8485.7617629644228},{"$f":"'(4) Entrada de dados'!M84","v":29435.60638234987},{"$f":"'(4) Entrada de dados'!N84","v":50385.451001735317},{"$f":"'(4) Entrada de dados'!O84","v":71335.295621120749}]
[null,null,null,null,null,null,120,{"$f":"'(4) Entrada de dados'!F85","v":-130219.87355724633},{"$f":"'(4) Entrada de dados'!G85","v":-109270.02893786089},{"$f":"'(4) Entrada de dados'!H85","v":-88320.184318475425},{"$f":"'(4) Entrada de dados'!I85","v":-67370.339699089964},{"$f":"'(4) Entrada de dados'!J85","v":-46420.495079704517},{"$f":"'(4) Entrada de dados'!K85","v":-25470.650460319062},{"$f":"'(4) Entrada de dados'!L85","v":-4520.8058409336154},{"$f":"'(4) Entrada de dados'!M85","v":16429.038778451839},{"$f":"'(4) Entrada de dados'!N85","v":37378.883397837286},{"$f":"'(4) Entrada de dados'!O85","v":58328.728017222747}]
[null,null,null,null,null,null,150,{"$f":"'(4) Entrada de dados'!F86","v":-143226.44116114435},{"$f":"'(4) Entrada de dados'!G86","v":-122276.5965417589},{"$f":"'(4) Entrada de dados'!H86","v":-101326.75192237346},{"$f":"'(4) Entrada de dados'!I86","v":-80376.90730298798},{"$f":"'(4) Entrada de dados'!J86","v":-59427.062683602533},{"$f":"'(4) Entrada de dados'!K86","v":-38477.218064217079},{"$f":"'(4) Entrada de dados'!L86","v":-17527.373444831621},{"$f":"'(4) Entrada de dados'!M86","v":3422.4711745538152},{"$f":"'(4) Entrada de dados'!N86","v":24372.315793939269},{"$f":"'(4) Entrada de dados'!O86","v":45322.160413324731}]
[null,null,null,null,null,null,180,{"$f":"'(4) Entrada de dados'!F87","v":-156233.00876504241},{"$f":"'(4) Entrada de dados'!G87","v":-135283.16414565692},{"$f":"'(4) Entrada de dados'!H87","v":-114333.31952627144},{"$f":"'(4) Entrada de dados'!I87","v":-93383.474906885996},{"$f":"'(4) Entrada de dados'!J87","v":-72433.630287500549},{"$f":"'(4) Entrada de dados'!K87","v":-51483.785668115102},{"$f":"'(4) Entrada de dados'!L87","v":-30533.941048729648},{"$f":"'(4) Entrada de dados'!M87","v":-9584.0964293442012},{"$f":"'(4) Entrada de dados'!N87","v":11365.74819004126},{"$f":"'(4) Entrada de dados'!O87","v":32315.592809426686}]
[null,null,null,null,null,null,210,{"$f":"'(4) Entrada de dados'!F88","v":-169239.57636894041},{"$f":"'(4) Entrada de dados'!G88","v":-148289.73174955492},{"$f":"'(4) Entrada de dados'!H88","v":-127339.88713016946},{"$f":"'(4) Entrada de dados'!I88","v":-106390.04251078401},{"$f":"'(4) Entrada de dados'!J88","v":-85440.197891398537},{"$f":"'(4) Entrada de dados'!K88","v":-64490.353272013112},{"$f":"'(4) Entrada de dados'!L88","v":-43540.50865262765},{"$f":"'(4) Entrada de dados'!M88","v":-22590.664033242207},{"$f":"'(4) Entrada de dados'!N88","v":-1640.819413856756},{"$f":"'(4) Entrada de dados'!O88","v":19309.025205528691}]
[null,null,null,null,null,null,240,{"$f":"'(4) Entrada de dados'!F89","v":-182246.14397283847},{"$f":"'(4) Entrada de dados'!G89","v":-161296.29935345298},{"$f":"'(4) Entrada de dados'!H89","v":-140346.45473406755},{"$f":"'(4) Entrada de dados'!I89","v":-119396.61011468204},{"$f":"'(4) Entrada de dados'!J89","v":-98446.765495296597},{"$f":"'(4) Entrada de dados'!K89","v":-77496.92087591115},{"$f":"'(4) Entrada de dados'!L89","v":-56547.076256525695},{"$f":"'(4) Entrada de dados'!M89","v":-35597.231637140256},{"$f":"'(4) Entrada de dados'!N89","v":-14647.387017754801},{"$f":"'(4) Entrada de dados'!O89","v":6302.4576016306528}]
[null,null,null,null,null,null,270,{"$f":"'(4) Entrada de dados'!F90","v":-195252.71157673644},{"$f":"'(4) Entrada de dados'!G90","v":-174302.86695735093},{"$f":"'(4) Entrada de dados'!H90","v":-153353.02233796549},{"$f":"'(4) Entrada de dados'!I90","v":-132403.17771858006},{"$f":"'(4) Entrada de dados'!J90","v":-111453.3330991946},{"$f":"'(4) Entrada de dados'!K90","v":-90503.488479809166},{"$f":"'(4) Entrada de dados'!L90","v":-69553.643860423705},{"$f":"'(4) Entrada de dados'!M90","v":-48603.799241038258},{"$f":"'(4) Entrada de dados'!N90","v":-27653.954621652796},{"$f":"'(4) Entrada de dados'!O90","v":-6704.1100022673563}]
[]
[null,null,null,"7.2 Variação do VPL mantendo-se os parâmetros constantes, exceto: o custo unitário do eletrolisador e o custo da fonte fóssil"]
[]
[null,null,null,null,null,null,{"$f":"'(4) Entrada de dados'!E79","v":"VPL"},{"$f":"'(4) Entrada de dados'!F79","v":"Custo do Gás Natural"},{"$f":"'(4) Entrada de dados'!G79","v":"BRL/m3"}]
[null,null,null,null,null,null,{"$f":"'(4) Entrada de dados'!E93","v":-38477.218064217079},0,0.8,1.6,2.4000000000000004,3.2,4,4.8,5.6,6.3999999999999995,7.1999999999999993]
[null,null,null,null,null,{"$f":"'(4) Entrada de dados'!D94","v":"Custo unitário do eletrolisador por unidade de potência instalada"},0,{"$f":"'(4) Entrada de dados'!F94","v":-65117.531948078285},{"$f":"'(4) Entrada de dados'!G94","v":-44167.687328692831},{"$f":"'(4) Entrada de dados'!H94","v":-23217.842709307373},{"$f":"'(4) Entrada de dados'!I94","v":-2267.9980899219086},{"$f":"'(4) Entrada de dados'!J94","v":18681.846529463539},{"$f":"'(4) Entrada de dados'!K94","v":39631.691148848993},{"$f":"'(4) Entrada de dados'!L94","v":60581.53576823444},{"$f":"'(4) Entrada de dados'!M94","v":81531.380387619894},{"$f":"'(4) Entrada de dados'!N94","v":102481.22500700534},{"$f":"'(4) Entrada de dados'!O94","v":123431.06962639082}]
[null,null,null,null,null,{"$f":"'(4) Entrada de dados'!D95","v":"BRL/kW"},1452.2,{"$f":"'(4) Entrada de dados'!F95","v":-80739.313790691478},{"$f":"'(4) Entrada de dados'!G95","v":-59789.469171306031},{"$f":"'(4) Entrada de dados'!H95","v":-38839.624551920577},{"$f":"'(4) Entrada de dados'!I95","v":-17889.779932535115},{"$f":"'(4) Entrada de dados'!J95","v":3060.0646868503336},{"$f":"'(4) Entrada de dados'!K95","v":24009.909306235779},{"$f":"'(4) Entrada de dados'!L95","v":44959.753925621233},{"$f":"'(4) Entrada de dados'!M95","v":65909.598545006695},{"$f":"'(4) Entrada de dados'!N95","v":86859.443164392156},{"$f":"'(4) Entrada de dados'!O95","v":107809.28778377759}]
[null,null,null,null,null,null,2904.4,{"$f":"'(4) Entrada de dados'!F96","v":-96361.095633304736},{"$f":"'(4) Entrada de dados'!G96","v":-75411.25101391926},{"$f":"'(4) Entrada de dados'!H96","v":-54461.406394533806},{"$f":"'(4) Entrada de dados'!I96","v":-33511.561775148337},{"$f":"'(4) Entrada de dados'!J96","v":-12561.71715576289},{"$f":"'(4) Entrada de dados'!K96","v":8388.1274636225571},{"$f":"'(4) Entrada de dados'!L96","v":29337.972083008004},{"$f":"'(4) Entrada de dados'!M96","v":50287.816702393458},{"$f":"'(4) Entrada de dados'!N96","v":71237.661321778898},{"$f":"'(4) Entrada de dados'!O96","v":92187.505941164331}]
[null,null,null,null,null,null,4356.6000000000004,{"$f":"'(4) Entrada de dados'!F97","v":-111982.87747591792},{"$f":"'(4) Entrada de dados'!G97","v":-91033.032856532474},{"$f":"'(4) Entrada de dados'!H97","v":-70083.188237146998},{"$f":"'(4) Entrada de dados'!I97","v":-49133.343617761551},{"$f":"'(4) Entrada de dados'!J97","v":-28183.498998376101},{"$f":"'(4) Entrada de dados'!K97","v":-7233.65437899065},{"$f":"'(4) Entrada de dados'!L97","v":13716.190240394808},{"$f":"'(4) Entrada de dados'!M97","v":34666.034859780251},{"$f":"'(4) Entrada de dados'!N97","v":55615.879479165669},{"$f":"'(4) Entrada de dados'!O97","v":76565.724098551116}]
[null,null,null,null,null,null,5808.8,{"$f":"'(4) Entrada de dados'!F98","v":-127604.65931853115},{"$f":"'(4) Entrada de dados'!G98","v":-106654.8146991457},{"$f":"'(4) Entrada de dados'!H98","v":-85704.970079760242},{"$f":"'(4) Entrada de dados'!I98","v":-64755.125460374766},{"$f":"'(4) Entrada de dados'!J98","v":-43805.280840989319},{"$f":"'(4) Entrada de dados'!K98","v":-22855.436221603879},{"$f":"'(4) Entrada de dados'!L98","v":-1905.5916022184247},{"$f":"'(4) Entrada de dados'!M98","v":19044.253017167015},{"$f":"'(4) Entrada de dados'!N98","v":39994.097636552498},{"$f":"'(4) Entrada de dados'!O98","v":60943.942255937916}]
[null,null,null,null,null,null,7261,{"$f":"'(4) Entrada de dados'!F99","v":-143226.44116114435},{"$f":"'(4) Entrada de dados'!G99","v":-122276.5965417589},{"$f":"'(4) Entrada de dados'!H99","v":-101326.75192237346},{"$f":"'(4) Entrada de dados'!I99","v":-80376.90730298798},{"$f":"'(4) Entrada de dados'!J99","v":-59427.062683602533},{"$f":"'(4) Entrada de dados'!K99","v":-38477.218064217079},{"$f":"'(4) Entrada de dados'!L99","v":-17527.373444831621},{"$f":"'(4) Entrada de dados'!M99","v":3422.4711745538152},{"$f":"'(4) Entrada de dados'!N99","v":24372.315793939269},{"$f":"'(4) Entrada de dados'!O99","v":45322.160413324731}]
[null,null,null,null,null,null,8713.2000000000007,{"$f":"'(4) Entrada de dados'!F100","v":-158848.22300375756},{"$f":"'(4) Entrada de dados'!G100","v":-137898.3783843721},{"$f":"'(4) Entrada de dados'!H100","v":-116948.53376498664},{"$f":"'(4) Entrada de dados'!I100","v":-95998.689145601209},{"$f":"'(4) Entrada de dados'!J100","v":-75048.844526215733},{"$f":"'(4) Entrada de dados'!K100","v":-54098.999906830293},{"$f":"'(4) Entrada de dados'!L100","v":-33149.155287444839},{"$f":"'(4) Entrada de dados'!M100","v":-12199.310668059392},{"$f":"'(4) Entrada de dados'!N100","v":8750.5339513260624},{"$f":"'(4) Entrada de dados'!O100","v":29700.37857071148}]
[null,null,null,null,null,null,10165.400000000001,{"$f":"'(4) Entrada de dados'!F101","v":-174470.00484637081},{"$f":"'(4) Entrada de dados'!G101","v":-153520.16022698535},{"$f":"'(4) Entrada de dados'!H101","v":-132570.31560759988},{"$f":"'(4) Entrada de dados'!I101","v":-111620.47098821442},{"$f":"'(4) Entrada de dados'!J101","v":-90670.626368828962},{"$f":"'(4) Entrada de dados'!K101","v":-69720.781749443529},{"$f":"'(4) Entrada de dados'!L101","v":-48770.937130058075},{"$f":"'(4) Entrada de dados'!M101","v":-27821.092510672635},{"$f":"'(4) Entrada de dados'!N101","v":-6871.2478912871666},{"$f":"'(4) Entrada de dados'!O101","v":14078.596728098266}]
[null,null,null,null,null,null,11617.600000000002,{"$f":"'(4) Entrada de dados'!F102","v":-190091.78668898402},{"$f":"'(4) Entrada de dados'!G102","v":-169141.94206959859},{"$f":"'(4) Entrada de dados'!H102","v":-148192.09745021313},{"$f":"'(4) Entrada de dados'!I102","v":-127242.25283082764},{"$f":"'(4) Entrada de dados'!J102","v":-106292.40821144221},{"$f":"'(4) Entrada de dados'!K102","v":-85342.563592056773},{"$f":"'(4) Entrada de dados'!L102","v":-64392.718972671304},{"$f":"'(4) Entrada de dados'!M102","v":-43442.874353285864},{"$f":"'(4) Entrada de dados'!N102","v":-22493.029733900403},{"$f":"'(4) Entrada de dados'!O102","v":-1543.1851145149703}]
[null,null,null,null,null,null,13069.800000000003,{"$f":"'(4) Entrada de dados'!F103","v":-205713.56853159724},{"$f":"'(4) Entrada de dados'!G103","v":-184763.72391221178},{"$f":"'(4) Entrada de dados'!H103","v":-163813.87929282634},{"$f":"'(4) Entrada de dados'!I103","v":-142864.03467344088},{"$f":"'(4) Entrada de dados'!J103","v":-121914.19005405541},{"$f":"'(4) Entrada de dados'!K103","v":-100964.34543466997},{"$f":"'(4) Entrada de dados'!L103","v":-80014.500815284511},{"$f":"'(4) Entrada de dados'!M103","v":-59064.656195899064},{"$f":"'(4) Entrada de dados'!N103","v":-38114.811576513603},{"$f":"'(4) Entrada de dados'!O103","v":-17164.96695712817}]
[]
[null,null,null,"7.3 Variação do VPL mantendo-se os parâmetros constantes, exceto: o custo da energia elétrica e o custo da fonte fóssil"]
[]
[null,null,null,null,null,null,{"$f":"'(4) Entrada de dados'!E79","v":"VPL"},{"$f":"'(4) Entrada de dados'!F79","v":"Custo do Gás Natural"},{"$f":"'(4) Entrada de dados'!G79","v":"BRL/m3"}]
[null,null,null,null,null,null,{"$f":"'(4) Entrada de dados'!E106","v":-38477.218064217079},0,0.8,1.6,2.4000000000000004,3.2,4,4.8,5.6,6.3999999999999995,7.1999999999999993]
[null,null,null,null,null,{"$f":"'(4) Entrada de dados'!D107","v":"Taxa de Desconto"},0,{"$f":"'(4) Entrada de dados'!F107","v":-200205.82256167076},{"$f":"'(4) Entrada de dados'!G107","v":-165703.31433427794},{"$f":"'(4) Entrada de dados'!H107","v":-131200.80610688517},{"$f":"'(4) Entrada de dados'!I107","v":-96698.29787949234},{"$f":"'(4) Entrada de dados'!J107","v":-62195.789652099542},{"$f":"'(4) Entrada de dados'!K107","v":-27693.281424706751},{"$f":"'(4) Entrada de dados'!L107","v":6809.2268026860402},{"$f":"'(4) Entrada de dados'!M107","v":41311.735030078824},{"$f":"'(4) Entrada de dados'!N107","v":75814.243257471622},{"$f":"'(4) Entrada de dados'!O107","v":110316.75148486442}]
[null,null,null,null,null,{"$f":"'(4) Entrada de dados'!D108","v":"a.a."},0.01,{"$f":"'(4) Entrada de dados'!F108","v":-185569.44083636638},{"$f":"'(4) Entrada de dados'!G108","v":-154584.22057568707},{"$f":"'(4) Entrada de dados'!H108","v":-123599.0003150078},{"$f":"'(4) Entrada de dados'!I108","v":-92613.780054328468},{"$f":"'(4) Entrada de dados'!J108","v":-61628.559793649176},{"$f":"'(4) Entrada de dados'!K108","v":-30643.339532969872},{"$f":"'(4) Entrada de dados'!L108","v":341.88072770942381},{"$f":"'(4) Entrada de dados'!M108","v":31327.100988388716},{"$f":"'(4) Entrada de dados'!N108","v":62312.321249068002},{"$f":"'(4) Entrada de dados'!O108","v":93297.541509747301}]
[null,null,null,null,null,null,0.02,{"$f":"'(4) Entrada de dados'!F109","v":-172810.33207685006},{"$f":"'(4) Entrada de dados'!G109","v":-144872.42987777264},{"$f":"'(4) Entrada de dados'!H109","v":-116934.52767869526},{"$f":"'(4) Entrada de dados'!I109","v":-88996.625479617884},{"$f":"'(4) Entrada de dados'!J109","v":-61058.723280540507},{"$f":"'(4) Entrada de dados'!K109","v":-33120.821081463131},{"$f":"'(4) Entrada de dados'!L109","v":-5182.9188823857548},{"$f":"'(4) Entrada de dados'!M109","v":22754.983316691621},{"$f":"'(4) Entrada de dados'!N109","v":50692.885515768983},{"$f":"'(4) Entrada de dados'!O109","v":78630.787714846374}]
[null,null,null,null,null,null,0.03,{"$f":"'(4) Entrada de dados'!F110","v":-161649.439327762},{"$f":"'(4) Entrada de dados'!G110","v":-136361.40497055123},{"$f":"'(4) Entrada de dados'!H110","v":-111073.37061334046},{"$f":"'(4) Entrada de dados'!I110","v":-85785.336256129725},{"$f":"'(4) Entrada de dados'!J110","v":-60497.301898918966},{"$f":"'(4) Entrada de dados'!K110","v":-35209.267541708206},{"$f":"'(4) Entrada de dados'!L110","v":-9921.2331844974542},{"$f":"'(4) Entrada de dados'!M110","v":15366.801172713305},{"$f":"'(4) Entrada de dados'!N110","v":40654.835529924065},{"$f":"'(4) Entrada de dados'!O110","v":65942.869887134817}]
[null,null,null,null,null,null,0.04,{"$f":"'(4) Entrada de dados'!F111","v":-151853.38711745423},{"$f":"'(4) Entrada de dados'!G111","v":-128877.98706832319},{"$f":"'(4) Entrada de dados'!H111","v":-105902.58701919214},{"$f":"'(4) Entrada de dados'!I111","v":-82927.186970061099},{"$f":"'(4) Entrada de dados'!J111","v":-59951.786920930099},{"$f":"'(4) Entrada de dados'!K111","v":-36976.38687179907},{"$f":"'(4) Entrada de dados'!L111","v":-14000.986822668034},{"$f":"'(4) Entrada de dados'!M111","v":8974.413226462988},{"$f":"'(4) Entrada de dados'!N111","v":31949.813275594031},{"$f":"'(4) Entrada de dados'!O111","v":54925.213324725046}]
[null,null,null,null,null,null,0.05,{"$f":"'(4) Entrada de dados'!F112","v":-143226.44116114435},{"$f":"'(4) Entrada de dados'!G112","v":-122276.5965417589},{"$f":"'(4) Entrada de dados'!H112","v":-101326.75192237346},{"$f":"'(4) Entrada de dados'!I112","v":-80376.90730298798},{"$f":"'(4) Entrada de dados'!J112","v":-59427.062683602533},{"$f":"'(4) Entrada de dados'!K112","v":-38477.218064217079},{"$f":"'(4) Entrada de dados'!L112","v":-17527.373444831621},{"$f":"'(4) Entrada de dados'!M112","v":3422.4711745538152},{"$f":"'(4) Entrada de dados'!N112","v":24372.315793939269},{"$f":"'(4) Entrada de dados'!O112","v":45322.160413324731}]
[null,null,null,null,null,null,6.0000000000000005E-2,{"$f":"'(4) Entrada de dados'!F113","v":-135603.96883241256},{"$f":"'(4) Entrada de dados'!G113","v":-116434.50196098148},{"$f":"'(4) Entrada de dados'!H113","v":-97265.03508955038},{"$f":"'(4) Entrada de dados'!I113","v":-78095.568218119239},{"$f":"'(4) Entrada de dados'!J113","v":-58926.101346688141},{"$f":"'(4) Entrada de dados'!K113","v":-39756.634475257044},{"$f":"'(4) Entrada de dados'!L113","v":-20587.167603825943},{"$f":"'(4) Entrada de dados'!M113","v":-1417.7007323948274},{"$f":"'(4) Entrada de dados'!N113","v":17751.766139036277},{"$f":"'(4) Entrada de dados'!O113","v":36921.23301046736}]
[null,null,null,null,null,null,7.0000000000000007E-2,{"$f":"'(4) Entrada de dados'!F114","v":-128847.10595329944},{"$f":"'(4) Entrada de dados'!G114","v":-111247.95068356236},{"$f":"'(4) Entrada de dados'!H114","v":-93648.795413825253},{"$f":"'(4) Entrada de dados'!I114","v":-76049.640144088175},{"$f":"'(4) Entrada de dados'!J114","v":-58450.484874351096},{"$f":"'(4) Entrada de dados'!K114","v":-40851.329604614009},{"$f":"'(4) Entrada de dados'!L114","v":-23252.174334876931},{"$f":"'(4) Entrada de dados'!M114","v":-5653.0190651398516},{"$f":"'(4) Entrada de dados'!N114","v":11946.136204597235},{"$f":"'(4) Entrada de dados'!O114","v":29545.291474334299}]
[null,null,null,null,null,null,0.08,{"$f":"'(4) Entrada de dados'!F115","v":-122838.39580379092},{"$f":"'(4) Entrada de dados'!G115","v":-106628.99597397138},{"$f":"'(4) Entrada de dados'!H115","v":-90419.596144151816},{"$f":"'(4) Entrada de dados'!I115","v":-74210.196314332279},{"$f":"'(4) Entrada de dados'!J115","v":-58000.796484512728},{"$f":"'(4) Entrada de dados'!K115","v":-41791.396654693192},{"$f":"'(4) Entrada de dados'!L115","v":-25581.99682487364},{"$f":"'(4) Entrada de dados'!M115","v":-9372.5969950541039},{"$f":"'(4) Entrada de dados'!N115","v":6836.8028347654399},{"$f":"'(4) Entrada de dados'!O115","v":23046.202664584984}]
[null,null,null,null,null,null,0.09,{"$f":"'(4) Entrada de dados'!F116","v":-117478.21373890013},{"$f":"'(4) Entrada de dados'!G116","v":-102502.88866703646},{"$f":"'(4) Entrada de dados'!H116","v":-87527.563595172775},{"$f":"'(4) Entrada de dados'!I116","v":-72552.23852330909},{"$f":"'(4) Entrada de dados'!J116","v":-57576.913451445413},{"$f":"'(4) Entrada de dados'!K116","v":-42601.588379581743},{"$f":"'(4) Entrada de dados'!L116","v":-27626.263307718058},{"$f":"'(4) Entrada de dados'!M116","v":-12650.938235854384},{"$f":"'(4) Entrada de dados'!N116","v":2324.3868360092893},{"$f":"'(4) Entrada de dados'!O116","v":17299.711907872959}]