{"text_format":"1","workbook":"xlsx","n_sheets":7,"sheets":["(1) Manual de operação","(2) Premissas","(3) Eletrolisadores","(4) Entrada de dados","(5) Simulação e Fluxo de Caixa","(6) Resultados","(7) Análise de sensibilidade"],"not_rendered":{"charts":1,"images":1,"macros":1,"external_links":0,"defined_names":79,"comments":1,"pivot_tables":0},"unopened":[],"bounds":{"document_bytes":16777216,"sheet_cells":100000,"rows_first":2000,"rows_last":500,"rows_between":2000,"halvings":0,"cell_chars":16384,"cell_head_chars":4096},"cells_cut":0,"cells_raw":0,"read":"whole","date_system":"1900"}

{"sheet":"(1) Manual de operação","index":0,"n_rows":0,"n_cols":0,"rows_kept":0,"cut":false,"hidden":false,"merged":[]}

{"sheet":"(2) Premissas","index":1,"n_rows":70,"n_cols":33,"rows_kept":70,"cut":false,"hidden":false,"merged":[]}
[]
[null,"2. Premissas",null,null,null,null,null,null,null,null,null,null,null,null,null,null,null,null,null,null,null,null,null,null,null,null,null,null,null,null,null,null,{"$f":"SUM(AG3:AG1048576)","v":{"$error":"#REF!"}}]
[]
[]
[null,null,null,"Premissas"]
[]
[]
[null,"2.1 Conversores de unidades"]
[null,null,"Conversão de Energia","joule  ","kilowatt-hora  ","Caloria (kcal IT)  ","BTU (IT)  "]
[null,null,"1 J  ",1,2.7777799999999999E-7,2.3884589999999999E-4,9.4781710000000003E-4]
[null,null,"1 kWh  ",3600000,1,859.84522786000002,3412.1416331]
[null,null,"1 kcal (IT)  ",4186.8,1.163E-3,1,3.9683207192999999]
[null,null,"1 BTU (IT)  ",1055.0558526,2.9307109999999998E-4,0.25199576109999999,1]
[]
[null,"2.2 Premissas adicionais",null,null,null,"Valores","Unidade"]
[null,null,null,null,"Fator de coprodução de O2 por eletrólise",8,"kg O2/kg H2"]
[null,null,null,null,"Densidade do O2",{"$f":"0.6998*293.15/273.15","v":0.75103924583562143},"kg/m3"]
[]
[null,"2.3 Lista de combustíveis"]
[null,null,"Combustível","Unidade comercial (S.I.)","Densidade (kg/m3)","Poder calorífico inferior (MJ/S.I.)","Fator de emissão (ton CO2eq/TJ)"]
{"$rows_left_out":51}
{"sheet":"(3) Eletrolisadores","index":2,"n_rows":14,"n_cols":12,"rows_kept":14,"cut":false,"hidden":false,"merged":[]}
[]
[null,"3. Eletrolisadores"]
[]
[null,null,"Modelo","Fabricante","Tecnologia","Pressão de saída [bar]","Potência [kW]","Capacidade de produção [kg/h]","Consumo de energia [kWh/kgH2]","Capacidade específica [Nm3/h/kW]","Capacidade específica [kg/h/kW]","Consumo de água [L/kg H2]"]
[null,null,"(20 MW) HyLYZER® -4.000-30","Cummins","PEM",30,20000,330.8,51,0.2,1.6539999999999999E-2,16.9286578]
[null,null,"(5 MW) HyLYZER® -1.000-30","Cummins","PEM",30,5000,82.7,51.995163239999997,0.2,1.6539999999999999E-2,16.9286578]
[null,null,"(2.5 MW) HyLYZER® -500-30","Cummins","PEM",30,2500,41.35,61.668681980000002,0.2,1.6539999999999999E-2,16.9286578]
[null,null,"(1.25 MW) SiLYZER 200","Siemens","PEM",35,1250,18.607500000000002,62,0.18,1.4886E-2,12.091898430000001]
[null,null,"(1.25 MW) SiLYZER 300","Siemens","PEM",35,1250,18.607500000000002,62,0.18,1.4886E-2,10]
[null,null,"(0.5 MW) HySTAT® - 100","Cummins","ALK",10,500,8.27,57.5,0.2,1.6539999999999999E-2,15]
[null,null,"(0.45 MW) HyProvide - A90","Green Hydrogen","ALK",35,450,8.1,53.6,0.2,1.6539999999999999E-2,10.88270859]
[null,null,"(19.4 MW) Nel A3880","Nel Hydrogen","ALK","1-200",19400,320.87599999999998,53.204353079999997,0.2,1.6539999999999999E-2,10.88270859]
[null,null,"(20 MW) Nel M4000","Nel Hydrogen","PEM",30,20000,330.8,54.776299880000003,0.2,1.6539999999999999E-2,10.88270859]
[null,null,"(2.07 MW) HGAS3SP","ITM Power","PEM",30,2070,36,57.5,0.2,1.7399999999999999E-2,25]

{"sheet":"(4) Entrada de dados","index":3,"n_rows":116,"n_cols":33,"rows_kept":116,"cut":false,"hidden":false,"merged":[]}
[]
[null,"4. Entradas",null,null,null,null,null,null,null,null,null,null,null,null,null,null,null,null,null,null,null,null,null,null,null,null,null,null,null,null,null,null,{"$f":"SUM(AG3:AG1048576)","v":0}]
[]
[]
[null,null,null,"Conjecturas: Produção de Hidrogênio Verde"]
[]
[null,null,"Código de Cores"]
[null,null,"Informativo"]
[null,null,"Dados de entrada"]
[]
[]
[]
[null,null,"4.1 Diagnóstico e análise preliminar",null,null,"Valor","Unidade","Descrição"]
[null,null,null,null,"Combustível ou fonte fóssil","Gás Natural",null,"Selecionar o combustível fóssil a ser substituído dentro da lista. Caso deseje utilizar outro combustível, a unidade comercial (m3 ou kg), o equivalente energético (MJ/unidade comercial) e o fator de emissão (ton CO2eq/TJ) da fonte devem ser fornecidos nos campos abaixo"]
[null,null,null,null,{"$f":"\"Consumo anual de \"&F14","v":"Consumo anual de Gás Natural"},20000000,{"$f":"INDEX('(2) Premissas'!D21:D25,MATCH('(4) Entrada de dados'!F14,'(2) Premissas'!C21:C25,0))","v":"m3"},"Definir o consumo total anual de combustível fóssil sendo utilizado em um processo, conforme a unidade comercial indicada ao lado"]
[null,null,null,null,"Equivalente energético",{"$f":"INDEX('(2) Premissas'!F21:F25,MATCH('(4) Entrada de dados'!F14,'(2) Premissas'!C21:C25,0))","v":36.843839999999993},{"$f":"\"MJ/\"&Unidade_fonte_substituida","v":"MJ/m3"},"Poder calorífico do combustível selecionado (captado na lista de combustíveis), a ser utilizado na simulação"]
[null,null,null,null,"Fator de emissão",{"$f":"INDEX('(2) Premissas'!G21:G25,MATCH('(4) Entrada de dados'!F14,'(2) Premissas'!C21:C25,0))","v":56.152000000000001},"tonCO2eq/TJ","Fator de emissão do combustível selecionado (captado na lista de combustíveis), a ser utilizado na simulação"]
[null,null,null,null,{"$f":"\"Consumo de energia associado ao uso de \"&F14","v":"Consumo de energia associado ao uso de Gás Natural"},{"$f":"Consumo_FonteFossil*F16*10^-6","v":736.87679999999989},"TJ/ano","Resultado da energia consumida, associado ao combustível selecionado"]
[null,null,null,null,{"$f":"\"Emissões de CO2 associadas ao uso de \"&F14","v":"Emissões de CO2 associadas ao uso de Gás Natural"},{"$f":"F18*fator_emissao_fonte_substituida","v":41377.106073599993},"ton CO2eq/ano","Resultado das emissões de CO2 que o processo proporciona"]
[null,null,null,null,"Substituição desejada da fonte fóssil",0.05,"(-)","Definir o quanto da energia consumida atualmente se deseja ou poder ser substituído por H2"]
{"$rows_left_out":97}
{"sheet":"(5) Simulação e Fluxo de Caixa","index":4,"n_rows":68,"n_cols":34,"rows_kept":68,"cut":false,"hidden":false,"merged":[]}
[]
[null,"5. Simulação da produção de H2, fluxos físicos e fluxo de Caixa"]
[]
[]
[null,null,"5.1 Fluxos físicos",null,null,null,0,1,2,3,4,5,6,7,8,9,10,11,12,13,14,15,16,17,18,19,20,null,"Acumulado no tempo de vida",null,null,null,null,"Descrição do campo"]
[]
[null,null,"Rastreamento da substituição da membrana na tencologia PEM",null,null,null,null,null,null,null,null,null,null,null,null,null,null,null,null,null,null,null,null,null,null,null,null,null,null,null,null,null,null,{"$f":"C7","v":"Rastreamento da substituição da membrana na tencologia PEM"}]
[null,null,"Horas de uso do eletrolisador",null,{"$f":"'(4) Entrada de dados'!G36","v":"h"},null,{"$f":"IF(G5>=posterga,Fator_Operacional*TDT,0)","v":0},0,8760,8760,8760,8760,8760,8760,8760,8760,8760,8760,8760,8760,8760,8760,8760,8760,8760,8760,8760,null,{"$f":"SUM(G8:AA8)","v":166440},null,null,null,{"$f":"E8","v":"h"},{"$f":"C8","v":"Horas de uso do eletrolisador"}]
[null,null,"Horas acumuladas",null,{"$f":"'(4) Entrada de dados'!G36","v":"h"},null,{"$f":"G8+F9","v":0},{"$f":"H8+G9","v":0},{"$f":"I8+H9","v":8760},{"$f":"IF(I10,J8,J8+I9)","v":17520},26280,35040,43800,52560,61320,70080,78840,8760,17520,26280,35040,43800,52560,61320,70080,78840,8760,null,{"$f":"SUM(G9:AA9)","v":797160},null,null,null,{"$f":"E9","v":"h"},{"$f":"C9","v":"Horas acumuladas"}]
[null,null,"Troca membrana",null," ",null,{"$f":"IF(G9>=duracao_membrana,TRUE,FALSE)","v":false},false,false,false,false,false,false,false,false,false,true,false,false,false,false,false,false,false,false,true,false,null,"n/a",null,null,null,{"$f":"E10","v":" "},{"$f":"C10","v":"Troca membrana"}]
[]
[]
[null,null,"Produção (fluxos físicos relacionados a Receitas)",null,null,null,null,null,null,null,null,null,null,null,null,null,null,null,null,null,null,null,null,null,null,null,null,null,null,null,null,null,null,{"$f":"C13","v":"Produção (fluxos físicos relacionados a Receitas)"}]
[null,null,"Produção de Hidrogênio",null,"ton",null,{"$f":"IF(G5=posterga,Prod_H2,0)","v":0},{"$f":"IF(H5=posterga,Prod_H2,0)","v":0},{"$f":"IF(OR(I5=posterga,H10),Prod_H2,H14-(Degradacao_aa_EL*H14))","v":724.452},717.20748000000003,710.03540520000001,702.93505114799996,695.90570063652001,688.94664363015477,682.05717719385325,675.23660542191476,668.48423936769564,724.452,717.20748000000003,710.03540520000001,702.93505114799996,695.90570063652001,688.94664363015477,682.05717719385325,675.23660542191476,668.48423936769564,724.452,null,{"$f":"SUM(G14:AA14)","v":13254.972605196277},null,null,null,{"$f":"E14","v":"ton"},{"$f":"C14","v":"Produção de Hidrogênio"}]
[null,null,"Produção de Oxigênio",null,"milhares m3",null,{"$f":"IF(G5=posterga,Prod_O2*Volume.especifico_O2,0)","v":0},{"$f":"IF(H5=posterga,Prod_O2*Volume.especifico_O2,0)","v":0},{"$f":"IF(OR(I5=posterga,H10),Prod_O2*Volume.especifico_O2,H15-(Degradacao_aa_EL*H15))","v":4352.7350697928605},4309.2077190949321,4266.1156419039826,4223.4544854849428,4181.2199406300933,4139.4077412237921,4098.0136638115546,4057.0335271734389,4016.4631919017047,4352.7350697928605,4309.2077190949321,4266.1156419039826,4223.4544854849428,4181.2199406300933,4139.4077412237921,4098.0136638115546,4057.0335271734389,4016.4631919017047,4352.7350697928605,null,{"$f":"SUM(G15:AA15)","v":79640.037031827465},null,null,null,{"$f":"E15","v":"milhares m3"},{"$f":"C15","v":"Produção de Oxigênio"}]
[]
[]
[null,null,"Cálculo de insumos evitados (fluxos físicos relacionados a Receitas)",null,null,null,null,null,null,null,null,null,null,null,null,null,null,null,null,null,null,null,null,null,null,null,null,null,null,null,null,null,null,{"$f":"C18","v":"Cálculo de insumos evitados (fluxos físicos relacionados a Receitas)"}]
[null,null,{"$f":"\"Consumo corrente de \"&'(4) Entrada de dados'!F14","v":"Consumo corrente de Gás Natural"},null,{"$f":"Unidade_fonte_substituida","v":"m3"},null,{"$f":"IF(G5>=posterga,-Consumo_FonteFossil,0)","v":0},0,-20000000,-20000000,-20000000,-20000000,-20000000,-20000000,-20000000,-20000000,-20000000,-20000000,-20000000,-20000000,-20000000,-20000000,-20000000,-20000000,-20000000,-20000000,-20000000,null,{"$f":"SUM(G19:AA19)","v":-380000000},null,null,null,{"$f":"E19","v":"m3"},{"$f":"C19","v":"Consumo corrente de Gás Natural"}]
[null,null,{"$f":"\"Consumo corrente de \"&'(4) Entrada de dados'!F14","v":"Consumo corrente de Gás Natural"},null,"TJ",null,{"$f":"PCI_fonte_substituida*G19/10^6","v":0},0,-736.87679999999989,-736.87679999999989,-736.87679999999989,-736.87679999999989,-736.87679999999989,-736.87679999999989,-736.87679999999989,-736.87679999999989,-736.87679999999989,-736.87679999999989,-736.87679999999989,-736.87679999999989,-736.87679999999989,-736.87679999999989,-736.87679999999989,-736.87679999999989,-736.87679999999989,-736.87679999999989,-736.87679999999989,null,{"$f":"SUM(G20:AA20)","v":-14000.659199999998},null,null,null,{"$f":"E20","v":"TJ"},{"$f":"C20","v":"Consumo corrente de Gás Natural"}]
{"$rows_left_out":49}
{"sheet":"(6) Resultados","index":5,"n_rows":106,"n_cols":32,"rows_kept":106,"cut":false,"hidden":false,"merged":[[8,8,20,10],[8,4,20,6],[26,4,38,6],[44,4,56,6],[44,8,56,10],[30,8,30,10],[31,8,32,10],[36,8,36,10],[37,8,39,10]]}
[]
[null,"6. Resultados",null,null,null,null,null,null,null,null,null,null,null,null,null,null,null,null,null,null,null,null,null,null,null,null,null,null,null,null,null,{"$f":"SUM(AF3:AF1048576)","v":{"$error":"#REF!"}}]
[]
[]
[null,null,"Relatório",null,"CAPEX eletrolisador",null,null,null,null,null,null,null,"Project Cash Flows",null,{"$f":"C87","v":"Fluxos de Caixa"},null,{"$f":"C106","v":"Fluxo de Caixa Acumulado"}]
[]
[null,null,null,null,"Valor Presente Líquido (milhares BRL)",null,null,null,"Período de Payback Simples"]
[null,null,null,null,"VPL do projeto de substituição",null,null,null,"Payback do projeto de substituição"]
[null,null,null,null,{"$f":"G89","v":-38477.218064217079},null,null,null,{"$f":"AC102","v":20}]
[]
[]
[]
[]
[]
[null,null,null,null,null,null,null,null,null,null,null,null,null,null,null,null,null,null,null,null,null,null,null,null,null,null,null,null,null,null,null,{"$f":"#REF!-AC87","v":{"$error":"#REF!"}}]
[]
[]
[]
[]
[]
{"$rows_left_out":87}
{"sheet":"(7) Análise de sensibilidade","index":6,"n_rows":56,"n_cols":33,"rows_kept":56,"cut":false,"hidden":false,"merged":[]}
[]
[null,null,null,"7. Análise de Sensibilidade",null,null,null,null,null,null,null,null,null,null,null,null,null,null,null,null,null,null,null,null,null,null,null,null,null,null,null,null,{"$f":"SUM(AG3:AG1048576)","v":0}]
[]
[]
[null,null,null,"Análise de sensibilidade aplicadas sobre o VPL do projeto de substituição"]
[]
[]
[]
[]
[]
[]
[]
[null,null,null,"7.1 Variação do VPL mantendo-se os parâmetros constantes, exceto: o custo da energia elétrica e o custo da fonte fóssil"]
[]
[null,null,null,null,null,null,{"$f":"'(4) Entrada de dados'!E79","v":"VPL"},{"$f":"'(4) Entrada de dados'!F79","v":"Custo do Gás Natural"},{"$f":"'(4) Entrada de dados'!G79","v":"BRL/m3"}]
[null,null,null,null,null,null,{"$f":"'(4) Entrada de dados'!E80","v":-38477.218064217079},0,0.8,1.6,2.4000000000000004,3.2,4,4.8,5.6,6.3999999999999995,7.1999999999999993]
[null,null,null,null,null,{"$f":"'(4) Entrada de dados'!D81","v":"Custo da energia elétrica"},0,{"$f":"'(4) Entrada de dados'!F81","v":-78193.603141654254},{"$f":"'(4) Entrada de dados'!G81","v":-57243.758522268785},{"$f":"'(4) Entrada de dados'!H81","v":-36293.913902883331},{"$f":"'(4) Entrada de dados'!I81","v":-15344.069283497873},{"$f":"'(4) Entrada de dados'!J81","v":5605.7753358875925},{"$f":"'(4) Entrada de dados'!K81","v":26555.61995527304},{"$f":"'(4) Entrada de dados'!L81","v":47505.464574658501},{"$f":"'(4) Entrada de dados'!M81","v":68455.309194043919},{"$f":"'(4) Entrada de dados'!N81","v":89405.153813429381},{"$f":"'(4) Entrada de dados'!O81","v":110354.99843281481}]
[null,null,null,null,null,{"$f":"'(4) Entrada de dados'!D82","v":"BRL/MWh"},30,{"$f":"'(4) Entrada de dados'!F82","v":-91200.170745552285},{"$f":"'(4) Entrada de dados'!G82","v":-70250.326126166809},{"$f":"'(4) Entrada de dados'!H82","v":-49300.481506781362},{"$f":"'(4) Entrada de dados'!I82","v":-28350.636887395896},{"$f":"'(4) Entrada de dados'!J82","v":-7400.7922680104457},{"$f":"'(4) Entrada de dados'!K82","v":13549.052351374994},{"$f":"'(4) Entrada de dados'!L82","v":34498.896970760456},{"$f":"'(4) Entrada de dados'!M82","v":55448.741590145917},{"$f":"'(4) Entrada de dados'!N82","v":76398.586209531364},{"$f":"'(4) Entrada de dados'!O82","v":97348.430828916811}]
[null,null,null,null,null,null,60,{"$f":"'(4) Entrada de dados'!F83","v":-104206.73834945029},{"$f":"'(4) Entrada de dados'!G83","v":-83256.893730064825},{"$f":"'(4) Entrada de dados'!H83","v":-62307.049110679363},{"$f":"'(4) Entrada de dados'!I83","v":-41357.204491293909},{"$f":"'(4) Entrada de dados'!J83","v":-20407.359871908462},{"$f":"'(4) Entrada de dados'!K83","v":542.48474747698492},{"$f":"'(4) Entrada de dados'!L83","v":21492.329366862432},{"$f":"'(4) Entrada de dados'!M83","v":42442.173986247901},{"$f":"'(4) Entrada de dados'!N83","v":63392.018605633333},{"$f":"'(4) Entrada de dados'!O83","v":84341.863225018809}]
[null,null,null,null,null,null,90,{"$f":"'(4) Entrada de dados'!F84","v":-117213.3059533483},{"$f":"'(4) Entrada de dados'!G84","v":-96263.461333962856},{"$f":"'(4) Entrada de dados'!H84","v":-75313.616714577394},{"$f":"'(4) Entrada de dados'!I84","v":-54363.772095191925},{"$f":"'(4) Entrada de dados'!J84","v":-33413.927475806478},{"$f":"'(4) Entrada de dados'!K84","v":-12464.082856421035},{"$f":"'(4) Entrada de dados'!L84","v":8485.7617629644228},{"$f":"'(4) Entrada de dados'!M84","v":29435.60638234987},{"$f":"'(4) Entrada de dados'!N84","v":50385.451001735317},{"$f":"'(4) Entrada de dados'!O84","v":71335.295621120749}]
{"$rows_left_out":36}